program: Gaussian 09
title: 000203500
version: EM64L-G09RevD.01
frameworkgroup: C1[X(C9H13NO)]
method: RPBEPBE
basis: SDD
operation: Freq
keyword: #p
keyword: freq=noraman
keyword: PBEPBE/SDD
title: #p freq=noraman PBEPBE/SDD
converged: YES YES NO NO
title: Mulliken charges:
elementType: O N C C C C C C C C C H H H H H H H H H H H H H
charge: -0.453160 -0.549920 -0.300000 -0.392782 0.515241 -0.337535 -0.450992 -0.401433 -0.220548 -0.236035 -0.246205 0.211407 0.204727 0.249563 0.212856 0.183332 0.232554 0.228005 0.265947 0.266101 0.225199 0.224389 0.228388 0.340900
chargesum: 0.00000
title: Mulliken charges with hydrogens summed into heavy atoms:
elementType: O N C C C C C C C C C
charge: -0.112260 -0.017872 -0.088593 0.061509 0.515241 0.058653 -0.218439 -0.173428 0.004651 -0.011647 -0.017817
polarizability: 1.21414487e+02 1.84074931e+01 8.67321278e+01 1.38890734e+00 1.70913606e+00 1.01773398e+02
1716.lowfreq: -15.0081 -8.7774 -7.4542 -0.0003 0.0001 0.0009 19.7656 59.2677 78.4847
frequency: 18.4699 59.2551 78.4619 146.9879 171.0641 206.6928 251.5611 270.9227 288.4579 323.0015 400.0656 415.1604 494.8243 552.8780 574.4790 615.8946 654.3926 705.2508 746.5149 779.8995 838.6610 850.5555 915.8441 951.9903 972.0260 977.5811 988.8797 992.6561 1020.0560 1034.8085 1037.4873 1078.9098 1105.2575 1154.7760 1171.1223 1184.9178 1187.8482 1196.6610 1233.8378 1274.9120 1295.0655 1316.6035 1343.1502 1356.0713 1386.3200 1413.1221 1441.3094 1470.6043 1477.8349 1486.9814 1591.2542 1608.0743 1637.6678 2934.5500 2974.5966 2989.9047 2997.2567 3071.1548 3109.7356 3109.8527 3129.3381 3140.6860 3160.8414 3430.4659 3557.5688 3567.7037
redmass: 3.8220 4.9550 2.2729 2.5920 3.3389 2.9804 1.1667 1.1342 3.5236 3.9212 2.7884 4.4543 3.5064 2.6723 2.1829 6.2993 1.8920 1.6736 2.3876 2.2385 1.2805 1.2493 1.4469 3.1921 1.4889 3.0963 5.7876 1.3140 2.2911 2.2436 1.5304 1.5671 2.9097 1.3590 1.0607 1.1838 1.4448 1.6543 1.4250 1.2072 1.3827 1.3964 1.3788 1.3627 4.8065 1.4574 2.1045 1.0887 2.2051 1.0863 5.9177 6.0545 1.0916 1.0581 1.0825 1.0851 1.0821 1.0999 1.0872 1.0871 1.0897 1.0954 1.1012 1.0447 1.0968 1.0665
irintensity: 0.0832 0.0588 11.8234 2.8442 7.4844 3.6043 40.8415 152.9003 3.9784 11.1688 1.0774 0.5084 13.5807 41.1084 59.6154 0.7032 255.6346 52.5509 19.4835 33.5456 15.7028 0.0939 1.4609 52.0909 4.1980 23.3653 0.0308 0.1462 20.9495 20.5777 7.7750 6.3733 4.7344 4.2077 0.1380 0.7953 5.5144 5.7602 35.3273 2.5523 7.0465 11.8670 3.2337 4.4312 1.1016 3.3711 10.5198 6.1139 10.6583 3.8005 1.1928 5.2369 36.1104 53.4631 19.3542 30.4495 55.7182 41.9661 10.8444 8.0464 4.5555 44.9194 25.9833 3.8507 0.2598 2.3314
temp: 298.150 k
press: 1.00000 atm
elementType: 8 7 6 6 6 6 6 6 6 6 6 1 1 1 1 1 1 1 1 1 1 1 1 1
symmnumber: 1
zpe: 531864.1 jmol-1
zpe.correction: 0.202576 hartree
zpe.thermalcorrener: 0.213988 hartree
zpe.thermalcorrenthalpy: 0.214933 hartree
zpe.thermalcorrgfe: 0.164041 hartree
zpe.sumelectzpe: -479.871455 hartree
zpe.sumelectthermal: -479.860043 hartree
zpe.sumelectthermalent: -479.859099 hartree
zpe.sumelectthermalfe: -479.909990 hartree
dipole: -2.1062 -1.1198 -0.5857
dipole: 2.4563
quadrupole: -72.5233 -63.8406 -60.5912
quadrupole: -3.4153 -3.0918 3.8050
quadrupole: -6.8716 1.8111 5.0605 -3.4153 -3.0918 3.8050
hfenergy: -480.0740313 hartree
pointgroup: C01 [X(C9H13N1O1)]
dipole: -0.8412121 0.3362229 0.3364147 debye
dipolederiv: -0.8187018 -0.2128662 -0.1321545 -0.251249 -0.5351951 0.1690547 -0.0967273 0.2023972 -0.2866582 -0.7009029 0.3386842 0.0028164 0.3642143 -0.7106556 -0.2221645 -0.0095361 -0.1600366 -0.2986174 0.4441622 -0.1068681 0.0680367 -0.1636856 0.4628702 0.1130316 0.0681832 0.1277491 0.3516543 -0.0106806 -0.0356499 0.0074148 -0.0130248 -0.0724126 -0.1024575 -0.0193813 -0.0836624 0.0517714 0.1210522 -0.0713928 -0.0140565 -0.1400062 -0.0827643 -0.0226426 -0.0481187 -0.0031162 -0.0917931 0.6129119 0.1672033 0.0532577 0.2469994 0.4656153 -0.0779493 0.1055055 -0.0783605 0.2958404 -0.175561 -0.005423 0.016238 -0.017537 -0.1101165 -0.0916103 0.0393864 -0.1217831 0.0199139 -0.1547129 0.0296068 -0.0686448 0.021714 -0.1578572 -0.0558532 -0.1452929 -0.0036304 0.0085185 0.0082111 -0.0328238 -0.0848468 -0.0418586 -0.0898278 -0.0432414 -0.1167827 -0.0235455 0.0655043 -0.0009983 -0.0912843 -0.0049566 -0.0853089 -0.0484115 -0.0999594 0.0114333 -0.0998821 0.0787431 -0.007749 -0.0864696 -0.0080281 -0.0977167 -0.1079176 -0.0245709 0.0039349 -0.0441843 -0.1164655 0.019188 0.0020789 0.0241503 0.0223242 -0.0106644 0.0461457 -0.0192094 0.0696973 -0.1619538 0.0927314 0.0068022 -0.0410077 -0.0146087 0.0295911 0.0656747 -0.0214973 0.0663484 -0.1329589 -0.0991684 0.1044423 0.0101 0.0855927 0.0303141 0.0026998 -0.0034813 -0.0195669 0.0784361 -0.1526782 0.0717198 0.0292346 0.1273438 -0.0696893 -0.0022443 0.0257426 0.0169886 0.0413681 -0.0163703 -0.0466062 0.0047623 -0.0504103 -0.0308459 0.1180726 0.0202153 0.1018272 -0.1775331 0.0845495 0.0644511 -0.0615768 0.0598808 0.0556483 0.109292 -0.028887 0.092963 -0.0318208 0.0214355 0.0110358 0.1273618 0.0170443 0.1210035 0.0076066 0.1186121 0.0192498 -0.017949 0.331604 -0.0720976 -0.0759661 -0.0818924 0.153401 0.1462923 -0.0168177 0.0469357 0.0329776 0.0870601 -0.2261459 -0.0046921 -0.1576998 0.2631851 -0.022867 0.0141758 -0.0690869 0.1308087 0.0027504 0.0276556 0.1163437 0.0245968 0.128729 0.0286489 0.130322 0.0227675 -0.0432235 0.0747632 0.0555465 -0.0331133 0.0727081 0.06137 0.1106943 -0.0435863 0.1167809 -0.0476734 -0.0715022 0.1232585 0.0103995 0.1264612 0.0822847 0.02481 0.0107772 0.0245774 0.0989365 0.3086062 -0.0148577 0.0589275 -0.0538815 0.1723454 -0.1764628 0.0210295 -0.2014273 0.1521737 unknown
polarizability: 121.384334|-17.0149082|88.9685468|-7.5170944|-5.1930707|99.5671318 unknown
InChI: InChI=1S/C9H13NO/c10-9(6-7-11)8-4-2-1-3-5-8/h1-5,9,11H,6-7,10H2
charge 0 multiplicity 1
24 atoms
O  3.527888 1.4881 0.60015
N  0.97126 -2.302192 -1.025699
C  0.907402 -1.224276 -0.006146
C  2.148745 -0.316326 -0.186443
C  -0.41452 -0.432837 -0.019871
C  2.282124 0.756475 0.896694
C  -1.287241 -0.466337 1.096362
C  -0.803213 0.321444 -1.159123
C  -2.517851 0.232234 1.080473
C  -2.026808 1.024215 -1.178945
C  -2.891303 0.981336 -0.057854
H  0.991001 -1.716223 0.984712
H  2.11505 0.185827 -1.174158
H  3.048192 -0.957562 -0.174662
H  1.408466 1.440754 0.877966
H  2.335181 0.280048 1.900684
H  -1.001937 -1.046795 1.983568
H  -0.143959 0.361889 -2.035725
H  1.106584 -1.947291 -1.980108
H  0.175478 -2.949355 -0.982267
H  -3.18121 0.191899 1.952205
H  -2.309899 1.605069 -2.06451
H  -3.842985 1.524308 -0.074205
H  3.639751 2.222898 1.254202
