program: Gaussian 09
title: 000203490
version: EM64L-G09RevD.01
frameworkgroup: C1[X(C11H11IN2O3S)]
method: RPBEPBE
basis: SDD
operation: Freq
keyword: #p
keyword: freq=noraman
keyword: PBEPBE/SDD
title: #p freq=noraman PBEPBE/SDD
converged: YES YES NO NO
title: Mulliken charges:
elementType: I S O O O N N C C C C C C C C C C C H H H H H H H H H H H
charge: 0.040545 0.340851 -0.306332 -0.252782 -0.253615 -0.418684 0.009595 0.327157 0.163597 -0.456516 0.515294 -0.469664 -0.295176 0.273610 -0.843931 -0.525708 -0.531470 -0.332078 0.329418 0.271652 0.351679 0.317430 0.318042 0.249964 0.229288 0.231423 0.230107 0.234120 0.252183
chargesum: 0.00000
title: Mulliken charges with hydrogens summed into heavy atoms:
elementType: I S O O O N N C C C C C C C C C C C
charge: 0.040545 0.340851 -0.306332 -0.252782 -0.253615 -0.067005 0.009595 0.327157 0.163597 -0.127098 0.515294 -0.469664 -0.023523 0.273610 -0.208459 0.184967 0.184940 -0.332078
polarizability: 2.85594305e+02 -1.65603935e+01 2.01255207e+02 -1.06497513e+01 6.53958560e+00 1.00586540e+02
1716.lowfreq: -4.0084 -0.3940 -0.0016 -0.0012 0.0009 6.5681 8.9101 27.4800 39.3040
frequency: 7.0807 27.4550 39.2948 55.6135 63.9535 66.5935 80.3843 101.2528 114.8178 145.1866 162.0152 178.9278 189.0939 214.2691 241.7863 250.7475 283.3430 294.9204 304.7959 347.8419 370.7052 389.3706 431.9504 447.2395 455.1645 468.7915 531.6386 553.4689 590.9222 615.0862 631.3649 667.9257 684.9341 701.0894 737.6767 791.2757 811.1385 838.7293 853.5231 904.1295 937.6299 947.6917 998.5805 1027.1657 1112.4731 1117.7895 1143.7208 1146.1669 1159.1080 1167.8263 1188.2928 1207.5731 1236.2897 1257.1165 1296.2652 1380.8875 1401.4424 1411.6068 1438.4015 1449.6167 1466.8249 1468.3930 1469.0188 1472.1056 1489.1604 1516.8958 1584.1945 1593.9465 1618.5223 2106.5441 2969.4144 2974.2222 3060.9882 3065.5905 3068.0456 3134.4146 3138.6259 3146.5724 3173.5541 3189.8523 3424.8451
redmass: 6.4444 9.3411 6.1185 10.5585 3.6699 4.4278 5.2222 6.7238 4.7535 4.2925 5.0031 3.9925 3.2136 1.2113 6.1735 1.4501 9.5812 3.3832 5.3690 8.8737 12.6485 8.2747 5.1492 5.3077 6.3149 4.4219 7.1648 3.0438 5.2195 12.6999 5.5603 5.6157 8.6282 6.4419 2.5598 1.2665 6.3525 1.6925 1.5045 1.5033 6.8061 6.9684 8.6456 3.9097 1.2573 1.2548 1.9006 1.2646 1.3718 2.0777 2.1788 1.2764 1.8569 1.5783 4.3718 7.3661 2.2223 1.2662 1.2504 1.5302 1.2061 1.0495 1.0547 1.0996 1.8044 2.7270 7.0845 5.6900 7.1696 12.7523 1.0325 1.0323 1.1047 1.0569 1.1047 1.1003 1.1007 1.1071 1.0913 1.0918 1.0769
irintensity: 2.1910 1.3956 1.3457 0.6989 13.8559 3.6647 1.8871 4.6336 3.1916 9.7262 2.2226 1.5624 1.1335 0.1946 0.9105 0.8248 1.0887 0.0288 0.3374 7.8297 1.3473 0.9970 16.5091 3.4006 2.2110 10.9400 13.3788 3.2896 26.8473 14.2778 77.9132 5.6647 7.8305 47.6128 1.3229 38.1821 15.6317 37.4534 20.2390 48.9594 7.5135 5.5530 94.8750 32.3031 0.0671 0.0648 6.3725 4.0196 18.4350 6.3146 146.6429 7.3669 95.8644 47.3669 12.4120 70.9876 94.6738 21.7404 7.5609 32.9545 180.0070 17.3821 18.0146 29.3627 95.7036 645.4611 291.3996 67.9608 43.7954 23.5894 64.7444 39.3232 37.9227 1.3124 33.7072 14.9337 17.2173 0.1686 1.6606 13.7703 109.0789
temp: 298.150 k
press: 1.00000 atm
elementType: 53 16 8 8 8 7 7 6 6 6 6 6 6 6 6 6 6 6 1 1 1 1 1 1 1 1 1 1 1
symmnumber: 1
zpe: 537140.5 jmol-1
zpe.correction: 0.204586 hartree
zpe.thermalcorrener: 0.224143 hartree
zpe.thermalcorrenthalpy: 0.225087 hartree
zpe.thermalcorrgfe: 0.151651 hartree
zpe.sumelectzpe: -1169.145188 hartree
zpe.sumelectthermal: -1169.125631 hartree
zpe.sumelectthermalent: -1169.124687 hartree
zpe.sumelectthermalfe: -1169.198123 hartree
dipole: 4.1698 -2.2926 -1.9540
dipole: 5.1441
quadrupole: -160.5299 -106.3985 -133.8625
quadrupole: -1.6557 14.6105 0.3423
quadrupole: -26.9330 27.1984 -0.2655 -1.6557 14.6105 0.3423
hfenergy: -1169.3497736 hartree
pointgroup: C01 [X(C11H11I1N2O3S1)]
dipole: -1.6474765 -0.9534207 0.6875917 debye
polarizability: 281.2901941|26.4384339|201.5093141|11.8110719|-18.5783462|104.6365441 unknown
InChI: InChI=1S/C11H11IN2O3S/c1-16-8-4-10(18-6-13)9(17-2)3-7(8)14-11(15)5-12/h3-4,14H,5H2,1-2H3
charge 0 multiplicity 1
29 atoms
I  -5.494758 -1.033317 -0.474019
S  3.55077 -0.790089 1.46827
O  -1.381567 -2.473569 0.466753
O  2.254318 1.81473 0.701003
O  -2.529742 2.245061 -0.441071
N  -2.28637 -0.064458 -0.073611
N  5.093404 -0.030934 -0.928953
C  -0.908771 -0.148176 0.251803
C  -0.415258 -1.455025 0.54666
C  -0.038109 0.963216 0.290707
C  1.324795 0.780943 0.632969
C  1.802924 -0.522059 0.920934
C  0.940617 -1.637603 0.873641
C  -3.004023 1.065376 -0.389492
C  -4.489459 0.933619 -0.738065
C  -0.952592 -3.847742 0.738696
C  1.801058 3.172044 0.367211
C  4.431122 -0.330874 0.024042
H  -0.445514 1.947899 0.057428
H  1.344016 -2.631122 1.08417
H  -2.781187 -0.96702 -0.058922
H  -4.635236 1.185785 -1.799904
H  -5.061543 1.635623 -0.11413
H  -1.856455 -4.461824 0.61892
H  -0.567205 -3.944746 1.771513
H  -0.180282 -4.171306 0.015225
H  1.014633 3.512219 1.067001
H  1.426465 3.220953 -0.67217
H  2.696851 3.799897 0.47289
