program: Gaussian 09
title: 000203485
version: EM64L-G09RevD.01
frameworkgroup: C1[X(C16H21N5)]
method: RPBEPBE
basis: SDD
operation: Freq
keyword: #pfreq=noraman
keyword: PBEPBE/SDD
title: #p freq=noraman PBEPBE/SDD
converged: NO YES NO NO
title: Mulliken charges:
elementType: N N N N N C C C C C C C C C C C C C C C C H H H H H H H H H H H H H H H H H H H H H
charge: -0.253656 -0.176391 -0.663909 -0.685035 0.015096 -0.370722 -0.386222 -0.381613 -0.395801 0.227136 0.464096 0.283053 0.330977 -0.382006 -0.372031 -0.365811 -0.438511 0.447782 -0.494411 -0.514264 -0.811664 0.185431 0.230166 0.232036 0.183675 0.205884 0.212887 0.222677 0.198796 0.216913 0.232825 0.223733 0.223960 0.226588 0.220399 0.320507 0.297860 0.305165 0.309341 0.225651 0.227492 0.221919
chargesum: 0.00000
title: Mulliken charges with hydrogens summed into heavy atoms:
elementType: N N N N N C C C C C C C C C C C C C C C C
charge: -0.253656 -0.176391 -0.045542 -0.070529 0.015096 0.044875 0.029489 0.037158 0.025672 0.227136 0.464096 0.283053 0.330977 -0.165093 -0.139206 -0.142079 -0.214551 0.447782 -0.267822 -0.293865 -0.136602
polarizability: 3.15962003e+02 -2.79506538e+00 1.86588894e+02 4.26520134e-01 4.31513214e+00 1.45667029e+02
1716.lowfreq: -7.0110 -2.6941 0.0003 0.0006 0.0007 4.7823 18.2610 32.0097 34.4509
frequency: 18.2454 31.8875 34.3427 50.3598 66.7841 72.6807 105.2640 148.1183 166.1646 193.8507 213.6936 218.0068 240.3679 281.9173 301.7829 305.0612 318.2566 339.6434 349.0711 379.3875 381.8328 383.2090 409.4000 412.8585 442.7829 466.3530 485.6988 515.6881 529.2408 566.8363 586.8449 587.5699 594.3285 618.3872 637.3309 663.6076 682.7830 714.0401 749.5603 752.6351 791.3456 809.0898 816.4356 824.9562 843.6568 847.1219 895.5501 926.7241 938.0893 954.0064 958.5187 981.2850 984.5210 1003.3835 1010.9795 1032.3217 1046.0991 1046.9955 1060.4849 1087.2104 1129.8144 1131.2816 1149.9300 1167.1515 1189.6296 1201.7954 1205.2387 1210.1368 1227.4192 1236.8758 1270.6604 1308.0680 1316.1919 1319.0731 1336.7127 1340.2397 1347.8821 1351.9506 1355.5940 1366.9620 1372.8502 1380.4222 1397.6296 1421.2683 1439.9244 1456.0195 1456.3771 1460.7635 1467.8353 1470.0693 1476.6449 1508.1232 1514.6906 1544.2859 1565.1079 1573.0699 1590.6339 1631.0089 1633.1253 2869.4295 2877.1618 2889.8665 2900.5110 2970.3065 3046.0769 3054.5508 3056.2541 3058.9302 3077.8729 3087.4937 3103.1876 3111.9787 3116.7674 3117.1496 3143.6461 3157.5101 3516.0111 3567.9331 3691.9785 3708.8262
redmass: 4.8116 3.7865 1.0547 4.6262 3.2956 4.4207 4.2220 4.2838 5.8683 4.3391 2.9237 3.4605 1.9666 2.7536 2.5401 1.2976 2.6623 2.2444 1.6617 2.9526 2.1122 1.9189 2.9229 1.5428 3.4314 2.8631 3.4787 3.1533 4.3651 4.6873 3.5098 1.6445 3.0705 2.5357 6.7296 3.7756 2.8640 2.8601 5.7629 2.2571 4.4068 1.6194 1.3496 2.0202 1.5624 1.5217 4.3058 1.3468 3.3287 1.3701 2.0885 2.0114 1.4463 2.7122 1.6445 2.4919 1.5193 1.7718 2.0564 2.2786 2.8933 1.3978 4.5790 2.1091 2.4963 1.1482 1.5190 1.6849 2.6900 1.6872 1.3731 1.4236 1.3269 1.9212 1.3790 5.6019 1.4723 1.8533 2.1373 1.8737 1.9296 1.4935 1.2382 3.4179 3.4919 1.0804 1.0853 1.1089 1.1168 1.0462 1.1041 3.4726 2.7291 3.5914 2.6931 5.7454 2.2713 3.3286 1.4324 1.0707 1.0699 1.0699 1.0711 1.0372 1.0976 1.0916 1.0881 1.0906 1.0983 1.0888 1.0891 1.0879 1.0921 1.0889 1.0945 1.0937 1.0464 1.0447 1.1013 1.1039
irintensity: 0.5216 0.3343 0.3805 1.7459 1.1100 2.2982 0.8614 0.4380 0.0668 0.4433 8.6631 0.8410 1.3622 6.6014 31.6978 125.4436 32.2498 72.5488 132.3540 14.9967 8.6948 3.3847 0.4814 36.5539 2.4007 2.9329 0.1871 15.5578 18.2920 1.1471 5.6852 35.2946 0.6493 14.4637 0.1658 3.6559 8.9830 2.0761 3.0620 4.6934 1.2087 56.5370 2.9924 59.2592 2.1451 0.1903 5.9638 1.5110 79.5204 1.2124 0.7460 0.0890 3.1869 4.3841 7.4606 36.1777 10.4844 1.6171 1.2252 4.4547 39.2475 5.8047 38.6751 38.5841 10.8750 5.4146 59.2693 69.4809 21.0209 87.1169 46.7545 46.0325 0.4668 33.1727 2.1471 21.1018 9.5360 13.9196 19.7297 25.7812 10.5280 26.5044 7.8841 3.5255 47.4455 0.2182 5.7771 51.7765 6.5412 11.8530 10.6609 51.8659 205.0471 3.0538 9.1816 11.8127 328.4029 70.9786 151.1354 61.1029 37.5725 61.1061 165.3301 63.7241 25.1538 16.8586 42.6807 15.9370 20.1304 20.9639 43.7064 17.7321 21.1667 31.3638 27.2491 12.9525 64.3650 39.5992 62.0713 34.0942
temp: 298.150 k
press: 1.00000 atm
elementType: 7 7 7 7 7 6 6 6 6 6 6 6 6 6 6 6 6 6 6 6 6 1 1 1 1 1 1 1 1 1 1 1 1 1 1 1 1 1 1 1 1 1
symmnumber: 1
zpe: 918256.8 jmol-1
zpe.correction: 0.349746 hartree
zpe.thermalcorrener: 0.369797 hartree
zpe.thermalcorrenthalpy: 0.370742 hartree
zpe.thermalcorrgfe: 0.299924 hartree
zpe.sumelectzpe: -894.500881 hartree
zpe.sumelectthermal: -894.480829 hartree
zpe.sumelectthermalent: -894.479885 hartree
zpe.sumelectthermalfe: -894.550702 hartree
dipole: -3.7161 0.1313 0.0514
dipole: 3.7188
quadrupole: -157.8760 -108.9922 -122.4312
quadrupole: 0.8729 -0.7304 -0.3364
quadrupole: -28.1096 20.7743 7.3353 0.8729 -0.7304 -0.3364
hfenergy: -894.8506264 hartree
pointgroup: C01 [X(C16H21N5)]
dipole: 1.4620865 0.044726 -0.0297565 debye
polarizability: 315.9667835|2.722808|182.7415713|-0.0574064|-12.6901454|149.5095714 unknown
InChI: InChI=1S/C16H21N5/c1-12-2-4-13(5-3-12)20-6-8-21(9-7-20)16-14(17)10-19-11-15(16)18/h2-5,10-11H,6-9,17-18H2,1H3
charge 0 multiplicity 1
42 atoms
N  -1.506892 -0.124887 -0.011691
N  1.363352 0.059267 0.003274
N  -3.018777 -2.443566 -0.066628
N  -3.014695 2.447286 0.043898
N  -5.802712 0.009772 -0.015029
C  -0.785279 0.301333 -1.233938
C  -0.788231 0.253035 1.226847
C  0.630039 -0.303114 -1.233346
C  0.637325 -0.334698 1.225888
C  -2.952736 -0.018549 -0.010631
C  2.78735 0.011456 0.00044
C  -3.700958 -1.23719 -0.039532
C  -3.668472 1.215236 0.016171
C  3.529086 0.523375 -1.107031
C  3.530621 -0.502054 1.102276
C  4.935519 0.516929 -1.104087
C  4.943368 -0.488527 1.094186
C  5.680327 0.014656 -0.003321
C  -5.127673 -1.16797 -0.040304
C  -5.097901 1.169026 0.012497
C  7.199469 0.026686 -0.009672
H  -0.693133 1.412226 -1.313839
H  -1.344459 -0.056324 -2.115954
H  -1.348818 -0.137687 2.093848
H  -0.700826 1.360607 1.350367
H  0.542634 -1.412604 -1.317085
H  1.180362 0.057593 -2.116043
H  1.172249 0.059397 2.107178
H  0.574454 -1.445597 1.323405
H  3.005026 0.957438 -1.965251
H  3.017946 -0.935986 1.965817
H  5.468993 0.925198 -1.972263
H  5.480577 -0.894035 1.960877
H  -5.730606 -2.084031 -0.062142
H  -5.679232 2.100176 0.032492
H  -1.999624 -2.400916 -0.065326
H  -3.510616 -3.330792 -0.087525
H  -3.556264 3.306546 0.062753
H  -2.002456 2.513787 0.056564
H  7.607205 -0.51516 -0.884128
H  7.597109 1.058965 -0.053984
H  7.60865 -0.448603 0.898873
