program: Gaussian 09
title: 000203480
version: EM64L-G09RevD.01
frameworkgroup: C1[X(C16H20N4O)]
method: RPBEPBE
basis: SDD
operation: Freq
keyword: #p
keyword: freq=noraman
keyword: PBEPBE/SDD
title: #p freq=noraman PBEPBE/SDD
converged: YES YES NO NO
title: Mulliken charges:
elementType: O N N N N C C C C C C C C C C C C C C C C H H H H H H H H H H H H H H H H H H H H
charge: -0.269764 -0.175541 -0.206333 -0.670387 -0.003530 -0.380252 -0.412437 -0.421890 -0.412152 0.468347 0.369796 0.245173 -0.385714 -0.350197 -0.282116 -0.358083 -0.376041 -0.459212 0.319667 -0.379316 -0.537386 0.200987 0.213512 0.224248 0.202500 0.252129 0.223215 0.199026 0.231730 0.219657 0.241289 0.232815 0.236587 0.245541 0.225447 0.233471 0.298910 0.318826 0.242885 0.217910 0.216679
chargesum: 0.00000
title: Mulliken charges with hydrogens summed into heavy atoms:
elementType: O N N N N C C C C C C C C C C C C C C C C
charge: -0.269764 -0.175541 -0.206333 -0.052650 -0.003530 0.034248 0.014311 0.053454 0.018604 0.468347 0.369796 0.245173 -0.166057 -0.108908 -0.049301 -0.121496 -0.130500 -0.233764 0.319667 -0.145845 0.140088
polarizability: 3.34827433e+02 -6.23232402e+00 1.74091350e+02 -3.44424568e+00 1.03632758e+00 1.38050879e+02
1716.lowfreq: -2.9824 -0.0006 0.0006 0.0008 3.1467 12.7368 22.3438 42.8902 52.2951
frequency: 22.1031 42.6127 52.2915 76.8384 81.8115 95.2662 119.9609 168.9885 172.0840 193.3611 227.2225 247.8801 257.6087 271.5708 300.6478 321.2486 357.9599 372.1251 389.4466 411.7926 421.0901 437.9935 459.5104 467.3891 479.2919 486.9926 528.9429 542.3221 552.2169 580.1436 597.5647 627.7651 635.0695 678.8521 714.7440 717.3529 754.9913 773.7353 798.1902 812.9296 817.1886 820.1467 853.1259 878.2888 897.7881 917.4440 928.1283 939.3568 940.5514 964.2283 987.2540 1000.7395 1031.3868 1036.8340 1049.1831 1054.2192 1067.6668 1096.5368 1113.6680 1120.1402 1145.9640 1158.8608 1179.0363 1182.7762 1193.2120 1206.3657 1223.8227 1231.2041 1240.6111 1266.5786 1283.7808 1310.8872 1320.9736 1334.0015 1343.0659 1344.5796 1350.5936 1355.7229 1373.3627 1378.3890 1383.8625 1415.1490 1427.9277 1438.3561 1457.2958 1459.1677 1465.2225 1467.0143 1470.9174 1474.7937 1492.8990 1507.7576 1559.7283 1568.8466 1576.2456 1616.8904 1632.6006 2881.2344 2887.7215 2905.4789 2927.3034 2952.1985 3036.8308 3049.3690 3053.7620 3064.6732 3083.0551 3099.4009 3120.3159 3132.9980 3138.4955 3148.0620 3160.2118 3162.1837 3170.0140 3508.8190 3660.1070
redmass: 5.3789 3.7648 5.0347 4.1892 3.2278 4.0459 4.4500 4.8235 4.9253 3.7919 2.1571 3.6481 1.4589 1.9554 2.8337 3.6943 3.9308 3.4642 2.8781 3.1685 3.3552 1.2737 2.5869 3.4023 2.5115 3.2797 2.3611 5.7795 1.2469 4.3085 5.2262 4.9050 6.1425 2.9865 3.4203 3.7626 4.0615 4.8094 1.3597 1.8348 1.6709 2.5191 1.5764 1.5192 3.8922 1.4116 1.4115 1.5488 2.6206 2.1242 5.4646 3.1998 1.7115 2.4239 1.9831 1.8504 2.0903 2.2396 1.2594 1.4100 4.7027 1.3521 2.4698 1.3515 1.5923 1.3380 1.5402 2.3252 2.0308 1.4723 1.7745 1.3236 1.9503 2.4598 1.5112 2.0225 1.6800 1.5925 2.5964 1.6274 1.5595 2.3348 3.2291 1.2171 1.0849 1.0929 1.1041 1.0504 1.1081 1.0718 3.0901 2.4215 6.4648 3.7942 7.0875 1.3303 6.4014 1.0717 1.0704 1.0686 1.0695 1.0333 1.1036 1.0912 1.0905 1.0930 1.0881 1.0904 1.0987 1.0880 1.0865 1.0869 1.0963 1.0949 1.0961 1.0456 1.1013
irintensity: 0.6009 1.9865 1.1109 3.6293 3.0720 1.0855 2.7046 1.6196 2.3060 1.3451 13.2824 0.2846 2.4647 1.0720 8.8297 3.1496 3.3540 4.0217 3.4270 5.9904 8.9224 103.7697 8.2495 9.3959 5.0919 6.3548 23.6138 0.7349 168.3775 8.2153 18.5403 3.6280 0.9116 28.0684 14.5795 0.8105 0.6000 11.4834 9.0216 27.5208 74.6323 28.9528 4.2043 5.5223 0.5744 1.2145 0.2877 20.5066 102.5523 2.5695 27.2984 66.3600 5.5065 11.9901 8.0875 8.3721 0.3587 0.1995 0.1869 8.3877 36.0839 0.3127 112.4722 38.5334 6.4612 47.5396 316.8255 102.2492 5.3272 19.8562 42.1268 0.0114 22.8283 37.4426 1.0285 11.1020 1.1319 0.6723 10.6267 0.9617 55.2596 15.5778 4.9996 22.5141 6.2352 20.2331 86.4177 12.3333 7.5608 67.4447 115.6901 340.6368 61.1624 44.7023 0.3444 146.3434 4.7890 66.7065 63.1469 85.0584 85.5306 81.4164 55.1283 27.5482 29.4130 8.0856 20.2777 39.0032 32.0226 15.5449 20.3932 15.1634 18.8548 21.4136 4.0936 28.6895 36.5939
temp: 298.150 k
press: 1.00000 atm
elementType: 8 7 7 7 7 6 6 6 6 6 6 6 6 6 6 6 6 6 6 6 6 1 1 1 1 1 1 1 1 1 1 1 1 1 1 1 1 1 1 1 1
symmnumber: 1
zpe: 889689.6 jmol-1
zpe.correction: 0.338865 hartree
zpe.thermalcorrener: 0.357740 hartree
zpe.thermalcorrenthalpy: 0.358684 hartree
zpe.thermalcorrgfe: 0.291292 hartree
zpe.sumelectzpe: -914.348754 hartree
zpe.sumelectthermal: -914.329879 hartree
zpe.sumelectthermalent: -914.328935 hartree
zpe.sumelectthermalfe: -914.396327 hartree
dipole: -3.5883 2.0743 0.5402
dipole: 4.1797
quadrupole: -155.1070 -112.9086 -122.0717
quadrupole: -3.9862 14.4624 1.2279
quadrupole: -25.0779 17.1205 7.9574 -3.9862 14.4624 1.2279
hfenergy: -914.6876193 hartree
pointgroup: C01 [X(C16H20N4O1)]
dipole: 1.4177315 0.3141635 0.7716864 debye
polarizability: 334.9316218|1.5781138|139.1137461|5.4369754|6.3273697|172.924294 unknown
InChI: InChI=1S/C16H20N4O/c1-21-14-4-2-13(3-5-14)19-8-10-20(11-9-19)16-6-7-18-12-15(16)17/h2-7,12H,8-11,17H2,1H3
charge 0 multiplicity 1
41 atoms
O  6.547626 0.110965 -0.248407
N  0.855066 -0.139161 -0.174785
N  -2.023853 0.100319 -0.154084
N  -3.579142 1.524105 1.705071
N  -6.297121 -0.328913 -0.058852
C  0.119033 0.074437 1.09401
C  0.129771 0.390737 -1.344609
C  -1.302509 -0.499672 1.008359
C  -1.298453 -0.183368 -1.411292
C  2.280404 -0.054408 -0.159931
C  -3.446573 -0.068074 -0.15663
C  -4.218342 0.65734 0.814568
C  3.034885 -0.715482 0.84927
C  3.006873 0.64756 -1.168299
C  -4.149001 -0.868663 -1.088181
C  4.444653 -0.678687 0.863819
C  4.413833 0.672916 -1.169574
C  -5.626892 0.465926 0.822047
C  5.144716 0.015342 -0.153847
C  -5.557405 -0.968506 -1.010886
C  7.333522 -0.571775 0.778017
H  0.055598 1.165023 1.328177
H  0.654394 -0.413136 1.923745
H  0.663142 0.090832 -2.263925
H  0.071913 1.505853 -1.324738
H  -1.858159 -0.276442 1.934817
H  -1.24811 -1.605887 0.891204
H  -1.229272 -1.280053 -1.604991
H  -1.839793 0.285872 -2.251847
H  2.522031 -1.297498 1.622189
H  2.47861 1.195854 -1.953527
H  -3.610752 -1.427665 -1.859864
H  4.979208 -1.207851 1.65866
H  4.96432 1.212067 -1.946934
H  -6.243808 0.995969 1.560539
H  -6.115439 -1.586355 -1.72264
H  -4.141402 2.10846 2.319536
H  -2.648829 1.85449 1.445933
H  8.383739 -0.370377 0.51939
H  7.151576 -1.664894 0.767984
H  7.117244 -0.1721 1.788908
