program: Gaussian 09
title: 000203483
version: EM64L-G09RevD.01
frameworkgroup: C1[X(C15H17ClN4)]
method: RPBEPBE
basis: SDD
operation: Freq
keyword: #p
keyword: freq=noraman
keyword: PBEPBE/SDD
title: #p freq=noraman PBEPBE/SDD
converged: YES YES NO NO
title: Mulliken charges:
elementType: Cl N N N N C C C C C C C C C C C C C C C H H H H H H H H H H H H H H H H H
charge: -0.073653 -0.206121 -0.174610 -0.670023 -0.001855 -0.410838 -0.421824 -0.408979 -0.377191 0.369281 0.485309 0.244898 -0.359140 -0.363388 -0.281770 -0.220600 -0.221628 -0.457781 -0.378324 -0.119220 0.199889 0.235251 0.255702 0.224257 0.211709 0.222538 0.212959 0.207579 0.240267 0.223998 0.232927 0.249659 0.250376 0.226957 0.234876 0.300505 0.318008
chargesum: 0.00000
title: Mulliken charges with hydrogens summed into heavy atoms:
elementType: Cl N N N N C C C C C C C C C C C C C C C
charge: -0.073653 -0.206121 -0.174610 -0.051510 -0.001855 0.024302 0.058134 0.025268 0.043347 0.369281 0.485309 0.244898 -0.118873 -0.139389 -0.048843 0.029059 0.028747 -0.230823 -0.143448 -0.119220
polarizability: 3.30711388e+02 4.15869059e+00 1.68355719e+02 3.85820721e+00 -9.36046504e-01 1.25207657e+02
1716.lowfreq: -0.0016 -0.0012 0.0007 3.3281 5.2700 10.5607 20.7139 41.9227 55.6096
frequency: 20.5399 41.7723 55.6028 78.0768 79.4599 106.9985 150.9401 174.3397 195.3931 225.8449 254.9859 272.3303 296.7381 315.9195 338.4622 340.5877 385.3350 410.9390 433.5072 442.3742 457.7388 461.8177 479.7232 494.0696 511.2775 553.3259 565.1491 597.6113 616.6547 625.9552 650.1748 697.2790 715.1074 732.0115 755.5902 798.6838 810.1085 813.5940 820.6257 850.5832 879.2832 897.8722 926.1874 929.1208 939.7785 943.2592 966.5569 984.3111 1030.7764 1034.4140 1049.8441 1054.1724 1069.6471 1081.8712 1096.7102 1120.4941 1148.3005 1180.4973 1194.5307 1197.9189 1209.2790 1225.4389 1242.9413 1268.1482 1284.8275 1302.9068 1321.4103 1334.2288 1343.6427 1347.3498 1351.7426 1359.0353 1372.2551 1378.3962 1384.9509 1413.7792 1415.3718 1455.8738 1460.0915 1465.1053 1471.2095 1490.9569 1493.0223 1560.9592 1569.0348 1573.4600 1609.9267 1616.9866 2896.6962 2900.0449 2912.1317 2927.3843 3055.1530 3057.2996 3065.7592 3089.4644 3101.0446 3133.9100 3148.5409 3154.6332 3160.9498 3170.0104 3176.7029 3509.6017 3659.4275
redmass: 7.2307 3.9373 6.9622 3.3490 5.2612 5.1657 6.0203 7.8191 4.2259 3.4430 2.8768 2.8862 3.2851 4.5045 4.3053 4.6764 2.2164 2.9786 2.6318 1.5024 3.2404 3.0617 2.3364 4.0148 2.7547 1.2813 4.5281 5.3866 6.5239 7.0299 2.7901 3.1976 3.4618 4.7859 4.0700 1.2815 1.7341 1.8605 2.4842 1.5907 1.5225 4.0324 1.3556 1.4013 3.1901 1.3852 2.1591 4.1402 1.7691 2.3650 1.9538 1.8847 2.0560 2.7167 2.2375 1.4294 4.7182 2.5729 1.6252 1.1699 1.2927 1.6156 1.7417 1.4738 1.7514 1.3034 1.9369 2.5069 1.6729 2.0415 1.4453 1.7638 2.4144 1.6417 1.4659 3.5810 2.3322 1.0894 1.0942 1.1105 1.1063 2.4118 3.0452 6.5557 3.7228 7.2063 5.7496 1.3589 1.0706 1.0713 1.0686 1.0695 1.0930 1.0892 1.0930 1.0883 1.0905 1.0880 1.0871 1.0880 1.0963 1.0962 1.0958 1.0455 1.1015
irintensity: 1.4917 0.7829 1.4224 2.0899 1.5620 0.1970 0.2672 0.2918 0.4780 13.9420 0.6058 1.3205 5.3219 4.8102 8.9007 7.0886 6.2643 0.6096 31.6152 68.4062 5.0726 19.1812 3.0078 3.1514 24.3641 163.2008 31.7888 19.9146 12.8426 0.1570 21.5362 3.1216 14.5728 10.3802 1.2879 0.1572 69.0274 34.1434 29.7951 4.1113 5.8260 0.3639 1.5949 0.8880 104.6914 7.3905 2.1048 21.2746 3.4813 25.2798 8.5241 11.6365 6.9303 17.4017 0.7904 6.1543 35.4693 70.9436 3.6587 1.0236 47.8761 221.3476 75.6850 20.2593 41.2697 0.7643 20.7083 40.2455 2.4550 14.0126 9.1037 8.0565 6.8361 10.7037 47.2200 0.5989 15.5471 2.7099 32.7215 95.4708 5.2580 297.2676 56.3627 70.9323 39.5360 1.7122 82.7550 145.5091 67.5332 18.2367 89.1518 101.9251 26.5619 25.5581 6.8181 19.1025 37.6536 14.6063 12.1608 8.3076 18.5398 13.5834 5.5222 28.0100 36.6486
temp: 298.150 k
press: 1.00000 atm
elementType: 17 7 7 7 7 6 6 6 6 6 6 6 6 6 6 6 6 6 6 6 1 1 1 1 1 1 1 1 1 1 1 1 1 1 1 1 1
symmnumber: 1
zpe: 782321.0 jmol-1
zpe.correction: 0.297970 hartree
zpe.thermalcorrener: 0.315507 hartree
zpe.thermalcorrenthalpy: 0.316451 hartree
zpe.thermalcorrgfe: 0.251468 hartree
zpe.sumelectzpe: -1259.389724 hartree
zpe.sumelectthermal: -1259.372188 hartree
zpe.sumelectthermalent: -1259.371243 hartree
zpe.sumelectthermalfe: -1259.436226 hartree
dipole: 0.1427 1.0449 1.4826
dipole: 1.8195
quadrupole: -184.5502 -111.4614 -122.2927
quadrupole: -6.4810 -5.8335 0.2689
quadrupole: -45.1154 27.9733 17.1421 -6.4810 -5.8335 0.2689
hfenergy: -1259.6876944 hartree
pointgroup: C01 [X(C15H17Cl1N4)]
dipole: 0.054984 -0.430109 -0.5695603 debye
polarizability: 330.6996914|-3.8519745|168.2237635|-4.5519933|-2.3614662|125.3513092 unknown
InChI: InChI=1S/C15H17ClN4/c16-12-1-3-13(4-2-12)19-7-9-20(10-8-19)15-5-6-18-11-14(15)17/h1-6,11H,7-10,17H2
charge 0 multiplicity 1
37 atoms
Cl 7.314799 -0.085165 0.024281
N  -1.659691 0.090729 -0.113363
N  1.225619 0.08144 0.084114
N  -3.280852 -2.016962 -1.026669
N  -5.927843 0.220685 0.357836
C  -0.900688 1.359216 -0.138107
C  -0.963189 -0.905518 0.753505
C  0.51936 1.123285 -0.687363
C  0.448857 -1.174264 0.212896
C  -3.081246 0.173932 0.058473
C  2.64258 0.025783 0.037274
C  -3.885643 -0.924034 -0.400476
C  3.40218 0.900367 -0.798222
C  3.367096 -0.888638 0.863231
C  -3.74819 1.291981 0.612422
C  4.813383 0.874363 -0.797753
C  4.774397 -0.925801 0.858883
C  -5.291301 -0.846172 -0.20133
C  -5.156517 1.280068 0.738913
C  5.488223 -0.039832 0.028445
H  -0.817391 1.804663 0.881541
H  -1.424136 2.079548 -0.791107
H  -1.543635 -1.843347 0.769045
H  -0.895218 -0.519934 1.796285
H  0.452343 0.854615 -1.767636
H  1.073735 2.073595 -0.601819
H  0.962491 -1.868259 0.895564
H  0.366775 -1.676978 -0.779799
H  2.905295 1.598234 -1.477124
H  2.83832 -1.561959 1.544096
H  -3.183709 2.162346 0.961154
H  5.374083 1.552017 -1.448568
H  5.307165 -1.628432 1.506553
H  -5.933699 -1.675126 -0.528261
H  -5.688268 2.136584 1.166903
H  -3.866482 -2.740885 -1.437071
H  -2.351507 -1.870444 -1.422248
