program: Gaussian 09
title: 000203468
version: EM64L-G09RevD.01
frameworkgroup: C1[X(C13H11N2)]
method: RPBEPBE
basis: SDD
operation: Freq
keyword: #p
keyword: freq=noraman
keyword: PBEPBE/SDD
title: #p freq=noraman PBEPBE/SDD
converged: YES YES NO NO
title: Mulliken charges:
elementType: N N C C C C C C C C C C C C C H H H H H H H H H H H
charge: -0.071800 0.079346 -0.523484 0.394161 -0.244345 -0.100258 -0.345861 -0.375897 0.374521 -0.168619 -0.235639 -0.219049 -0.217995 -0.210533 -0.216087 0.301199 0.269133 0.312665 0.324485 0.245112 0.251038 0.289199 0.311479 0.257299 0.258792 0.261137
chargesum: 1.00000
title: Mulliken charges with hydrogens summed into heavy atoms:
elementType: N N C C C C C C C C C C C C C
charge: -0.071800 0.079346 0.046848 0.394161 0.068319 0.224227 -0.100748 -0.124859 0.374521 0.120580 0.075840 0.038251 0.040797 0.050604 -0.216087
polarizability: 2.21862992e+02 2.39170698e+01 1.14020790e+02 -2.67961311e+00 -1.53515284e+00 1.01471925e+02
1716.lowfreq: -14.9343 -6.8473 -0.0006 -0.0004 0.0001 2.1526 6.6512 45.4986 64.6794
frequency: -6.9535 45.4923 64.6680 125.8420 136.8929 180.3651 233.3954 276.3420 318.4705 369.0793 400.4431 429.2900 453.2051 463.3137 538.8316 554.7228 584.4449 615.1786 633.1466 685.5853 700.6684 711.8649 771.4378 821.8443 835.1603 858.8864 872.3490 918.5521 937.3543 944.0627 972.4334 988.2959 989.7533 1015.1701 1016.2313 1016.5429 1025.6265 1086.8251 1094.0718 1118.3435 1185.2399 1194.3060 1202.6280 1218.4257 1226.8285 1227.4459 1300.5743 1334.1488 1336.8048 1372.6704 1388.7480 1425.5319 1445.0932 1458.3924 1483.6465 1489.9442 1567.8760 1592.6616 1607.7433 1617.7098 2202.5395 3024.1801 3092.2850 3123.6366 3126.0351 3152.9418 3165.9865 3180.3508 3181.4036 3188.0421 3191.9225 3206.3601
redmass: 5.2153 3.8781 5.2355 8.5864 5.6735 3.9151 4.4609 6.2043 2.1128 4.4874 2.7928 3.3868 3.8403 8.4486 7.3561 5.5338 5.4125 6.3470 4.8225 2.1696 3.5891 2.0917 2.1665 2.9077 1.5527 1.2571 5.3783 1.4953 1.4715 1.5995 1.4045 1.3966 6.0611 1.4337 3.7768 1.4613 2.2337 2.5121 1.6008 1.6710 1.0569 1.1187 1.2588 1.5556 1.7549 2.3226 1.8007 1.2624 1.3843 2.6521 7.9652 2.2099 2.0914 1.1542 2.2438 2.3299 5.0390 5.9046 5.8815 5.3143 12.6192 1.0590 1.1068 1.0905 1.0905 1.0896 1.0953 1.1013 1.0925 1.0959 1.0944 1.1011
irintensity: 3.3342 0.2802 1.3825 5.1127 0.9235 1.4830 3.5912 0.2670 1.9212 0.3337 0.0738 3.0077 4.9109 0.2483 4.9039 14.2698 2.2567 0.0052 8.0443 31.6070 8.2484 79.8770 38.1161 10.4740 33.8524 1.6796 22.1743 7.6405 4.3928 5.6896 0.2271 0.1973 5.2640 0.1305 2.6015 0.0760 1.4861 50.9005 17.3401 37.4587 0.0368 3.3587 23.7599 15.1358 1.3866 20.8646 8.1173 0.4139 0.2770 2.4084 2.3184 31.7985 11.9442 10.1594 32.0261 46.4049 0.9698 2.5533 4.0752 6.3350 13.9414 8.2241 0.7096 4.9332 5.8480 0.9985 8.3926 6.6117 0.4412 5.2634 23.6437 9.3238
temp: 298.150 k
press: 1.00000 atm
elementType: 7 7 6 6 6 6 6 6 6 6 6 6 6 6 6 1 1 1 1 1 1 1 1 1 1 1
symmnumber: 1
zpe: 540211.4 jmol-1
zpe.correction: 0.205756 hartree
zpe.thermalcorrener: 0.217182 hartree
zpe.thermalcorrenthalpy: 0.218126 hartree
zpe.thermalcorrgfe: 0.167527 hartree
zpe.sumelectzpe: -610.188591 hartree
zpe.sumelectthermal: -610.177165 hartree
zpe.sumelectthermalent: -610.176221 hartree
zpe.sumelectthermalfe: -610.226819 hartree
dipole: 0.5678 2.2310 -0.6538
dipole: 2.3932
quadrupole: -65.9080 -70.6901 -77.5178
quadrupole: -6.2498 1.2974 0.9713
quadrupole: 5.4640 0.6819 -6.1459 -6.2498 1.2974 0.9713
hfenergy: -610.3943466 hartree
pointgroup: C01 [X(C13H11N2)]
dipole: 0.1645738 0.6971798 0.6110351 debye
dipolederiv: -0.6939178 0.0751839 -0.046863 0.1726965 -0.0747789 -0.0323997 0.1435686 -0.0472751 -0.1114679 0.0736101 0.068733 0.1027512 0.0616958 -0.1318906 0.0370284 0.0864995 0.0372308 -0.0970324 1.1857904 -0.1152671 0.0432708 -0.2472039 0.2179367 0.0090334 -0.1420073 0.0121065 0.2352816 -0.2395683 0.0320841 -0.015752 0.0639301 0.007554 -0.0417776 -0.0839734 -0.0247483 -0.1713873 0.0732575 -0.1061958 -0.2047499 0.1040042 0.019602 0.0476563 0.2044304 0.0394386 0.1319109 0.0814461 0.0400407 0.0771218 -0.1733954 0.0295053 0.006905 -0.2142284 0.0027386 0.0274597 -0.0645028 0.1144464 0.0311293 -0.0694923 0.012036 -0.0495977 0.1143406 0.0324835 -0.0838435 -0.0660186 -0.0443891 0.0933385 0.1618314 -0.0207418 -0.0219768 0.05911 -0.119946 -0.0351982 0.4072985 0.1553821 0.257048 0.073996 0.1347193 -0.045806 0.138601 -0.0552245 0.0201592 -0.326979 -0.014002 -0.0270192 0.0251052 -0.0175141 0.1053185 0.0609052 0.1167991 0.1421202 0.1233945 -0.0407483 -0.1016074 -0.0353637 0.0091701 0.0500073 -0.079739 0.0488361 0.1010599 -0.140943 -0.0772294 0.0344234 -0.0896516 0.0666427 -0.1169307 0.0361938 -0.1184823 -0.0417214 -0.0259729 0.1579099 -0.009631 0.174642 0.0376151 0.0153716 -0.0245228 0.0155483 -0.1216921 0.1087378 0.0118091 0.1333541 0.0085601 -0.0347233 -0.0261128 0.1240497 -0.0248348 -0.0219554 -0.2580937 -0.0657958 -0.1013263 -0.0618021 -0.009627 -0.0630208 -0.066322 -0.0615383 -0.0794838 -0.0140907 0.0201214 0.0112338 0.0839611 0.0167831 0.0824291 0.0075069 0.0265549 0.0608538 -0.0604525 -0.0475374 -0.0572833 -0.056903 0.0085854 -0.0639666 0.013047 -0.0160351 0.0872343 0.1380153 0.0122908 0.0384186 0.0015048 0.1493941 -0.0302041 0.0000237 -0.0286623 0.108553 0.2302727 -0.0405315 -0.0064874 -0.0438773 0.1417019 -0.0082551 -0.0761115 0.0129977 0.1200989 0.0436282 -0.1074931 -0.0338568 -0.1121369 0.0121222 0.0088826 -0.0433991 -0.0097319 0.1153924 0.1089633 0.0449576 -0.0667076 0.037917 0.0059504 0.0759103 -0.0696055 0.0954165 0.063868 0.09083 -0.0109735 -0.0153361 -0.0019889 0.1446682 -0.0388853 -0.0115691 -0.0392032 0.0891321 0.0772475 0.0043453 0.0177226 -0.0013278 0.1552112 -0.0145538 0.0129503 -0.0138922 0.1297143 0.0939509 0.0146779 -0.0403134 0.0236303 0.0011773 0.0792818 -0.0575958 0.077707 0.0994881 0.0505223 -0.0753366 -0.0248825 -0.0917021 0.0119245 0.0167606 -0.0346225 0.0219578 0.135372 0.003574 -0.0064826 -0.0879962 -0.0086295 0.1069764 0.0189019 -0.0975302 0.0197586 0.0960833 unknown
polarizability: 216.4047644|12.5888708|106.2331177|31.4202347|7.5995914|114.7178252 unknown
InChI: InChI=1S/C13H11N2/c14-9-13-7-4-8-15(11-13)10-12-5-2-1-3-6-12/h1-8,11H,10H2
charge 1 multiplicity 1
26 atoms
N  -0.649735 0.263833 -0.553637
N  -5.368612 -0.504029 -1.443452
C  0.621391 -0.021611 -1.389763
C  1.888068 -0.058768 -0.570612
C  -1.863795 -0.082339 -1.085687
C  -0.559559 0.880744 0.669103
C  2.238417 -1.227455 0.156854
C  2.750504 1.068294 -0.543611
C  -3.060098 0.188443 -0.387268
C  -1.722349 1.175662 1.400718
C  -2.986361 0.831184 0.881472
C  3.432421 -1.262994 0.90828
C  3.947983 1.028991 0.205287
C  4.287135 -0.134654 0.934045
C  -4.319529 -0.190732 -0.966664
H  0.654978 0.774717 -2.154026
H  0.426969 -0.985868 -1.889424
H  -1.863205 -0.56931 -2.063781
H  0.447106 1.113481 1.021519
H  1.592097 -2.113658 0.122912
H  2.501982 1.966066 -1.123568
H  -1.626546 1.668838 2.370399
H  -3.902669 1.048594 1.437476
H  3.704427 -2.168896 1.458932
H  4.616723 1.895251 0.211777
H  5.218355 -0.167883 1.508617
