program: Gaussian 09
title: 000203439
version: EM64L-G09RevD.01
frameworkgroup: C1[X(C7H10ClN3O3)]
method: RPBEPBE
basis: SDD
operation: Freq
keyword: #p
keyword: freq=noraman
keyword: PBEPBE/SDD
title: #p freq=noraman PBEPBE/SDD
converged: YES YES NO NO
title: Mulliken charges:
elementType: Cl O O O N N N C C C C C C C H H H H H H H H H H
charge: -0.045032 -0.426747 -0.227752 -0.182331 -0.160753 -0.034923 0.072481 -0.384504 -0.013061 0.261942 -0.310510 -0.595775 0.073582 -0.755453 0.228639 0.276826 0.216705 0.331354 0.257434 0.299621 0.240838 0.225847 0.284555 0.367016
chargesum: 0.00000
title: Mulliken charges with hydrogens summed into heavy atoms:
elementType: Cl O O O N N N C C C C C C C
charge: -0.045032 -0.059731 -0.227752 -0.182331 -0.160753 -0.034923 0.072481 0.120961 0.203645 0.261942 0.020844 -0.038721 0.073582 -0.004213
polarizability: 1.61123227e+02 -6.25857458e+00 1.23052411e+02 9.13650164e+00 7.57401196e+00 7.49008272e+01
1716.lowfreq: -7.5263 -3.0217 0.0011 0.0018 0.0025 10.7328 30.5976 42.2961 46.6148
frequency: 30.5287 42.1654 46.5978 72.1449 93.6837 124.9773 152.0490 163.6389 172.1853 225.5880 265.1999 294.5885 322.2370 340.6229 388.7369 398.6041 456.5979 529.3850 548.9958 605.8501 636.5485 662.7496 679.7765 716.3868 734.4707 784.0253 825.2396 849.7640 860.7087 951.3109 959.7607 993.3248 1029.1481 1046.5042 1063.6025 1108.5902 1136.4437 1183.7801 1194.2786 1204.1060 1237.4822 1288.0359 1295.9883 1302.8539 1328.7277 1351.5936 1364.2461 1376.6298 1395.6804 1401.6470 1431.9135 1449.7696 1465.9269 1471.7729 1497.2145 1522.8934 2921.7284 2983.5775 3036.2222 3057.6941 3066.0516 3106.6014 3125.4041 3152.9329 3263.4505 3550.8073
redmass: 8.2132 5.4486 10.9783 6.1105 5.4406 1.1005 5.9553 4.6244 7.3966 4.0154 3.0256 1.7670 2.0865 2.4308 4.0959 4.7258 3.0525 4.4643 4.7145 5.7991 5.7253 4.8702 5.1714 6.4240 8.3917 4.1263 1.4227 3.4067 1.7753 5.6939 2.1504 1.8744 2.0766 1.4793 2.2115 1.9554 1.9607 1.4065 1.3845 2.2532 2.5263 1.4146 7.3410 1.2818 1.7490 1.5569 6.3340 2.0497 2.4141 1.4908 1.1043 1.1301 1.1516 1.0873 5.1360 5.2225 1.0823 1.0397 1.0606 1.0979 1.0580 1.1041 1.0961 1.1102 1.1015 1.0665
irintensity: 3.7363 2.8493 1.1732 4.7815 2.5202 0.3143 0.6800 0.6454 1.5457 20.7011 5.3536 62.1399 61.9375 77.5651 0.7803 4.8698 8.9053 24.0225 0.5259 0.3310 10.1851 17.7564 7.2924 5.3429 24.1471 12.7654 21.8127 17.4144 6.4882 8.7062 23.3969 7.1806 39.6711 1.7434 31.9523 5.4279 30.7820 14.2628 34.6191 165.9726 82.1338 15.5642 49.3989 14.7149 10.8380 19.7010 113.6778 55.1908 7.3113 8.0825 15.1743 14.9022 8.5177 28.7282 47.3868 72.9471 32.5238 19.7663 12.3830 16.3983 16.4985 4.4624 3.1352 3.5948 11.9442 7.0431
temp: 298.150 k
press: 1.00000 atm
elementType: 17 8 8 8 7 7 7 6 6 6 6 6 6 6 1 1 1 1 1 1 1 1 1 1
symmnumber: 1
zpe: 462606.3 jmol-1
zpe.correction: 0.176197 hartree
zpe.thermalcorrener: 0.190634 hartree
zpe.thermalcorrenthalpy: 0.191578 hartree
zpe.thermalcorrgfe: 0.132540 hartree
zpe.sumelectzpe: -1121.561202 hartree
zpe.sumelectthermal: -1121.546766 hartree
zpe.sumelectthermalent: -1121.545821 hartree
zpe.sumelectthermalfe: -1121.604859 hartree
dipole: -6.7730 4.7547 0.4790
dipole: 8.2892
quadrupole: -125.4516 -89.6277 -85.6483
quadrupole: -5.3075 -4.1428 0.6529
quadrupole: -25.2091 10.6149 14.5942 -5.3075 -4.1428 0.6529
hfenergy: -1121.7373997 hartree
pointgroup: C01 [X(C7H10Cl1N3O3)]
dipole: -2.7557101 -1.7435905 -0.039575 debye
dipolederiv: -0.3302373 0.0725633 0.0663706 0.1416442 -0.244841 -0.1232211 0.1566081 -0.1317059 -0.3324691 -0.3869349 -0.1644237 -0.0504449 -0.1623273 -0.538699 0.1907546 -0.1765897 0.1739572 -0.6354396 -0.5502938 -0.0848469 0.0415259 -0.2139419 -0.8559629 -0.0556496 0.0312568 -0.0599229 -0.2619948 -0.8753967 0.1243936 0.1277145 0.0750184 -0.4603734 -0.0476443 0.1432979 -0.0575056 -0.241529 -0.7329972 0.0414774 0.0704554 -0.4233945 -0.345582 0.0499066 0.020217 -0.0126122 -0.1494252 -0.4007401 -0.0268052 0.0088403 0.12969 -0.3164047 -0.0364839 0.0663881 -0.0000579 -0.2063634 1.7559896 0.1963923 -0.2425761 0.4038653 1.2075253 0.0790366 -0.2563977 0.0895301 0.2558929 0.4719298 -0.0324724 -0.0678695 -0.0387999 0.1143378 0.0169465 -0.1384209 0.0284489 0.0763496 0.2179223 0.1314489 -0.0049671 0.1872141 0.4328846 -0.2323524 0.2003507 -0.1807606 0.3583905 0.219539 -0.0964175 -0.0550627 -0.0225019 0.6153843 0.045358 -0.0567291 0.0528 0.0220916 0.6566875 0.1642321 -0.0824227 0.3004681 -0.2095572 -0.0288076 -0.1347457 0.0069656 -0.095923 0.273768 -0.1586547 -0.1402569 -0.1369582 0.3226247 0.2448509 -0.3303774 0.243258 0.4188637 -0.7131498 -0.1945485 0.0734235 -0.1623776 0.0775612 0.0460465 0.1349851 0.0325879 0.0234718 -0.0332681 -0.0698106 0.0176275 -0.0167102 -0.1378486 -0.0197743 0.0428381 0.0016162 0.0804485 0.0151956 -0.0226957 -0.0007148 -0.072638 -0.0372572 0.0930486 0.0179133 0.0560471 0.0519299 0.0645019 -0.0094856 -0.0048899 0.0081838 0.0332816 -0.0875325 -0.0037593 -0.0355323 0.0553323 -0.0102073 0.0620283 0.085902 -0.0379663 -0.126988 -0.0644101 0.0296316 -0.081236 -0.04866 0.1214678 0.0247545 0.029453 0.0188461 0.1105264 -0.0152426 0.0337454 -0.0284172 0.2011357 0.068042 0.0053578 0.0526729 -0.0456241 -0.1043147 -0.0280455 0.0789265 -0.0194703 0.0258847 0.0161603 0.0450963 -0.0171057 0.0817039 0.0618344 -0.0123013 -0.0273383 -0.024263 -0.0582296 0.0707809 -0.0733576 0.0737595 -0.0545631 0.0380983 0.0035085 0.0759208 0.0627901 -0.0633238 -0.0416058 -0.0629994 -0.1187888 -0.0276373 0.0571352 0.0370653 -0.1312028 -0.0109814 0.0073973 0.0261829 0.1118567 0.0391797 0.0304235 0.0598098 -0.0189405 0.0289513 -0.0365416 0.1236103 0.0966633 0.0169169 0.0981742 0.0383829 0.2468252 -0.0361162 0.1945302 -0.0689943 0.3925585 unknown
polarizability: 160.2927054|5.0195364|122.4292101|-13.7723573|8.0721419|76.3545501 unknown
InChI: InChI=1S/C7H10ClN3O3/c1-5-9-7(11(13)14)4-10(5)3-6(12)2-8/h4,6,12H,2-3H2,1H3
charge 0 multiplicity 1
24 atoms
Cl -4.529992 1.111747 1.023249
O  -2.106644 1.305753 -1.191941
O  3.048013 2.115151 0.072227
O  4.187687 0.185779 -0.404959
N  -0.24814 -0.398851 0.429224
N  1.771116 -1.280721 -0.124667
N  3.115533 0.828611 -0.106518
C  -1.695692 -0.290967 0.680321
C  -2.47969 0.010001 -0.625532
C  0.47569 -1.570499 0.107199
C  0.64237 0.672379 0.388201
C  -3.993718 0.026953 -0.422636
C  1.871242 0.096446 0.048681
C  -0.125636 -2.940951 0.062484
H  -2.052254 -1.233684 1.130326
H  -1.878972 0.525035 1.39794
H  -2.276012 -0.805399 -1.359409
H  0.366875 1.694232 0.628588
H  -4.382234 -0.977217 -0.196114
H  -4.485999 0.452552 -1.307875
H  -0.516913 -3.255714 1.048225
H  -0.950745 -3.019173 -0.66986
H  0.663587 -3.648283 -0.232673
H  -1.168871 1.281021 -1.513581
