program: Gaussian 09
title: 000203448
version: EM64L-G09RevD.01
frameworkgroup: C1[X(C12H17Cl2NO)]
method: RPBEPBE
basis: SDD
operation: Freq
keyword: #p
keyword: freq=noraman
keyword: PBEPBE/SDD
title: #p freq=noraman PBEPBE/SDD
converged: YES YES NO NO
title: Mulliken charges:
elementType: Cl Cl O N C C C C C C C C C C C C H H H H H H H H H H H H H H H H H
charge: -0.023196 -0.037406 -0.325444 -0.098847 0.325941 -0.362316 -0.748720 -0.691311 -0.638601 -0.616522 0.560375 -0.252333 -0.244640 -0.235515 -0.245046 -0.218334 0.196352 0.214766 0.238518 0.227410 0.238491 0.262302 0.215206 0.196777 0.185842 0.210825 0.278321 0.188073 0.219942 0.221217 0.259170 0.259087 0.239615
chargesum: 0.00000
title: Mulliken charges with hydrogens summed into heavy atoms:
elementType: Cl Cl O N C C C C C C C C C C C C
charge: -0.023196 -0.037406 -0.325444 -0.098847 0.325941 0.048802 -0.044302 -0.017026 0.036387 0.012710 0.560375 -0.252333 -0.244640 0.023655 0.014041 0.021281
polarizability: 2.02738066e+02 2.12597155e+00 1.69882640e+02 -2.69997519e+00 2.58184088e+00 1.05787197e+02
1716.lowfreq: -8.0315 -0.0008 0.0007 0.0015 11.5010 13.0094 27.5627 31.2560 51.3241
frequency: 26.4958 31.0871 51.3163 69.0681 94.2426 140.4339 145.8732 176.5170 192.2837 199.2335 208.3616 210.8286 238.4481 251.4281 261.8248 294.5620 294.8636 320.6133 353.1474 376.7956 379.0338 383.9064 418.0893 444.3894 504.0016 509.6051 514.0992 532.1395 600.4879 662.1542 730.8292 744.3293 769.9194 798.1962 821.5389 851.6268 889.3453 899.3510 928.5239 958.9168 978.2226 1004.0044 1038.6224 1041.1520 1052.1197 1070.4555 1090.7812 1107.3008 1137.5895 1151.7032 1186.7150 1188.8253 1210.5374 1231.3632 1247.8761 1271.7207 1316.0588 1337.5840 1364.1511 1380.1913 1397.0065 1415.7908 1418.7089 1420.8752 1434.3763 1448.1226 1454.9428 1458.3982 1460.6724 1470.7379 1475.6719 1481.4529 1483.3089 1491.0870 1553.1367 1578.9180 2846.1740 2862.8124 2904.7519 2988.7549 2995.3512 3012.5157 3016.3326 3028.7307 3071.8689 3084.6357 3091.0394 3093.5750 3115.7875 3127.9181 3152.2925 3169.0477 3182.2487
redmass: 4.6305 2.7007 5.1596 5.8037 4.6641 4.1787 3.3714 1.8202 4.6847 3.8722 1.8224 1.1174 1.3206 1.6989 1.5906 4.2614 2.6867 2.7335 3.8155 2.5850 4.4471 5.4310 2.1384 2.3648 6.8656 5.5703 4.0613 3.4870 4.0712 6.1862 9.1196 3.7749 1.5321 3.5239 3.7301 5.8358 1.3527 1.9626 1.4171 1.3217 1.6557 1.4327 1.5432 5.3281 2.1617 2.2849 1.2409 1.6529 1.4903 1.4494 1.5629 2.1590 2.8094 3.0850 2.9457 2.6751 1.4377 7.1882 1.3574 1.2311 1.2184 2.6284 2.2793 1.2630 1.1117 1.0700 1.0706 1.0880 1.0465 1.0613 1.0570 1.0512 1.0712 1.0534 6.8541 7.4395 1.0570 1.0572 1.0666 1.0356 1.0391 1.0720 1.0895 1.0767 1.1008 1.0981 1.0976 1.0993 1.0974 1.1004 1.0867 1.0928 1.1000
irintensity: 0.1220 0.3717 1.0988 1.4929 1.7193 2.5060 0.3236 0.3078 0.2713 0.7915 0.7070 1.9754 0.2838 0.2704 0.7281 5.0131 0.7683 4.8107 5.4665 1.3620 6.0929 0.8588 0.3136 0.5844 4.5579 1.1715 5.5987 1.6117 1.3463 21.0109 74.5640 34.8581 50.8732 12.3256 14.3088 77.9716 0.0031 0.4306 1.2739 0.8970 4.9544 3.3226 15.7409 20.2553 83.0451 20.7719 0.7278 115.7409 10.9253 5.2534 24.6671 81.5339 13.6252 69.9709 13.6045 7.7190 19.2039 11.9485 1.2528 33.9981 29.8609 108.8046 46.3599 15.7104 2.6500 5.6446 2.7909 9.0362 15.2749 15.0297 9.3619 18.3557 26.5187 12.4427 23.2603 1.5765 108.5363 149.8693 62.1825 11.5181 16.1480 41.0512 33.4858 50.0618 40.1864 7.4767 35.4084 26.7688 8.4848 12.5690 2.5746 1.6439 8.7055
temp: 298.150 k
press: 1.00000 atm
elementType: 17 17 8 7 6 6 6 6 6 6 6 6 6 6 6 6 1 1 1 1 1 1 1 1 1 1 1 1 1 1 1 1 1
symmnumber: 1
zpe: 693068.0 jmol-1
zpe.correction: 0.263976 hartree
zpe.thermalcorrener: 0.282046 hartree
zpe.thermalcorrenthalpy: 0.282990 hartree
zpe.thermalcorrgfe: 0.217266 hartree
zpe.sumelectzpe: -1516.297142 hartree
zpe.sumelectthermal: -1516.279072 hartree
zpe.sumelectthermalent: -1516.278128 hartree
zpe.sumelectthermalfe: -1516.343852 hartree
dipole: 0.9330 1.0565 1.8007
dipole: 2.2867
quadrupole: -93.8968 -113.4142 -109.9073
quadrupole: 1.8131 -1.6079 -1.1195
quadrupole: 11.8426 -7.6747 -4.1679 1.8131 -1.6079 -1.1195
hfenergy: -1516.5611181 hartree
pointgroup: C01 [X(C12H17Cl2N1O1)]
dipole: -0.393388 -0.2406968 0.7724678 debye
polarizability: 202.8233828|1.1392006|165.8728384|3.1534872|-15.4992916|109.7116813 unknown
InChI: InChI=1S/C12H17Cl2NO/c1-12(2,8-15(3)4)16-11-9(13)6-5-7-10(11)14/h5-7H,8H2,1-4H3
charge 0 multiplicity 1
33 atoms
Cl -1.70125 2.570798 -1.052389
Cl -0.503047 -2.663852 0.569439
O  0.144548 0.202134 -0.369578
N  3.231551 -0.083496 -0.437145
C  1.095843 0.681522 0.759656
C  2.324885 -0.270112 0.714522
C  0.395271 0.575018 2.1260
C  1.486755 2.125677 0.417384
C  2.757126 -0.719956 -1.686458
C  4.627475 -0.452782 -0.130589
C  -1.203768 -0.046571 -0.168295
C  -2.204355 0.918004 -0.487474
C  -1.69181 -1.331358 0.210875
C  -3.583204 0.642061 -0.414531
C  -3.062029 -1.639181 0.295382
C  -4.012212 -0.64173 -0.01385
H  2.906116 -0.054261 1.632599
H  1.952205 -1.318603 0.799798
H  -0.5538 1.139214 2.133274
H  1.049481 1.015347 2.899508
H  0.190091 -0.473596 2.403708
H  1.878697 2.175478 -0.609454
H  0.625412 2.805818 0.518837
H  2.292412 2.458767 1.09847
H  2.750559 -1.8379 -1.625835
H  3.419832 -0.424461 -2.520335
H  1.732742 -0.386469 -1.907606
H  4.767711 -1.543778 0.083426
H  4.988745 0.117513 0.744251
H  5.271145 -0.196716 -0.991909
H  -4.305848 1.420884 -0.67356
H  -3.375866 -2.644259 0.590334
H  -5.081113 -0.867252 0.046345
