program: Gaussian 09
title: 000203426
version: EM64L-G09RevD.01
frameworkgroup: C1[X(C7H12ClN)]
method: RPBEPBE
basis: SDD
operation: Freq
keyword: #p
keyword: freq=noraman
keyword: PBEPBE/SDD
title: #p freq=noraman PBEPBE/SDD
converged: YES YES NO NO
title: Mulliken charges:
elementType: Cl N C C C C C C C H H H H H H H H H H H H
charge: -0.100099 -0.268616 -0.178957 -0.178956 -0.434167 -0.434167 -0.416581 -0.416581 -0.356247 0.239027 0.239027 0.200286 0.235180 0.235180 0.200286 0.226981 0.227638 0.227639 0.226980 0.246292 0.279854
chargesum: 0.00000
title: Mulliken charges with hydrogens summed into heavy atoms:
elementType: Cl N C C C C C C C
charge: -0.100099 -0.022324 0.060070 0.060071 0.001299 0.001299 0.038038 0.038038 -0.076393
polarizability: 1.04470736e+02 -4.75522813e-06 7.99061098e+01 1.07187016e+00 2.96827107e-06 7.30735110e+01
1716.lowfreq: -7.2590 -0.0026 -0.0017 -0.0015 3.3216 25.3565 118.2284 178.5637 223.1856
frequency: 118.1581 178.5416 223.1840 269.9227 324.8213 393.6152 404.6512 465.2184 507.7978 637.7117 735.1337 740.5251 783.1177 804.7523 816.8986 851.1453 875.0111 894.8117 940.9188 973.3610 973.5777 995.8667 1028.6979 1059.7279 1093.3221 1133.6671 1149.4478 1152.5855 1187.3617 1194.4273 1225.4659 1227.7749 1246.5016 1251.6933 1280.7139 1287.1110 1309.8794 1332.3072 1345.2853 1348.7340 1393.1330 1458.7017 1466.9941 1469.5751 1484.2837 2992.9597 2995.2274 3011.7793 3023.4732 3038.1816 3044.6323 3050.3151 3057.8344 3070.9092 3079.4015 3095.1038 3415.8138
redmass: 4.0980 1.9384 4.8579 7.6986 1.8479 3.1746 2.1321 3.7582 2.0080 4.0074 4.7164 1.8127 2.6997 2.5587 3.2122 1.9600 1.5519 2.3905 1.9350 2.0472 2.5089 1.9323 2.3216 1.6349 1.7188 1.9391 1.0867 1.4848 1.2259 1.3722 1.3402 1.5254 1.3420 1.3403 1.3480 1.3395 1.2419 1.5377 1.3818 1.4584 1.4532 1.0921 1.0831 1.0945 1.0941 1.0602 1.0611 1.0599 1.0649 1.0867 1.0915 1.0926 1.1023 1.1037 1.0952 1.1039 1.0745
irintensity: 2.4907 0.0809 2.6440 14.0417 0.0062 2.2171 5.1971 0.1969 19.7730 147.6780 3.0465 41.9930 25.2802 2.1141 53.5140 8.6785 1.4871 7.0455 15.5395 0.1627 11.6970 0.8961 14.3026 5.5824 4.4894 0.0909 0.5233 8.7304 2.1123 5.9330 6.8294 45.2945 12.4188 0.1820 32.8669 1.7681 0.7997 0.5086 2.7914 0.0350 20.1144 1.6220 7.5715 14.3015 9.1990 19.2940 13.1948 16.6975 49.0714 89.5126 11.4948 3.0213 28.9630 1.8808 42.0002 63.6839 2.4351
temp: 298.150 k
press: 1.00000 atm
elementType: 17 7 6 6 6 6 6 6 6 1 1 1 1 1 1 1 1 1 1 1 1
symmnumber: 1
zpe: 477978.5 jmol-1
zpe.correction: 0.182052 hartree
zpe.thermalcorrener: 0.189896 hartree
zpe.thermalcorrenthalpy: 0.190841 hartree
zpe.thermalcorrgfe: 0.149455 hartree
zpe.sumelectzpe: -788.034963 hartree
zpe.sumelectthermal: -788.027119 hartree
zpe.sumelectthermalent: -788.026175 hartree
zpe.sumelectthermalfe: -788.067561 hartree
dipole: -1.8596 0.0000 -0.1557
dipole: 1.8661
quadrupole: -74.7633 -58.9604 -59.3180
quadrupole: 0.0000 2.9209 0.0000
quadrupole: -10.4161 5.3869 5.0292 0.0000 2.9209 0.0000
hfenergy: -788.2170158 hartree
pointgroup: C01 [X(C7H12Cl1N1)]
dipole: 0.7337566 -0.0000885 0.0254528 debye
dipolederiv: -0.9879505 0.0000839 0.1467838 0.0000864 -0.2480432 -0.0000184 0.0236032 -0.000004 -0.2061422 -0.7012993 0.0000225 0.2658682 0.000022 -0.4560549 -0.0000326 0.3020249 -0.0000373 -0.4267467 0.5400216 0.0270286 -0.0703347 -0.155408 0.3343834 0.1072439 -0.0754843 0.1242422 0.2379686 0.5400506 -0.0270746 -0.0703609 0.1553598 0.3343652 -0.1072205 -0.0755037 -0.1242179 0.2379564 0.0804839 0.0486678 -0.08212 0.0511223 0.0217625 0.0574745 -0.0640493 0.0417998 0.0197762 0.0804597 -0.0486772 -0.0821363 -0.0511334 0.021792 -0.0574558 -0.064062 -0.0417846 0.019771 -0.3620803 -0.0325936 0.1058852 -0.044067 -0.0279873 0.0521824 0.0333935 0.0160791 0.0324718 -0.3620586 0.0326683 0.1058731 0.044147 -0.0280022 -0.052211 0.0333892 -0.016091 0.0324681 1.1123832 -0.0001006 -0.1175109 -0.0001005 0.2317097 0.0000129 -0.0882423 0.0000101 0.2325375 -0.0362789 -0.0672246 0.0392417 -0.0533752 -0.1397076 0.0694795 0.0359 0.0915891 0.0196286 -0.0362492 0.0671972 0.0392284 0.0533482 -0.1397273 -0.0694978 0.0358807 -0.0916065 0.0196196 0.0380924 0.0690931 0.1116074 0.0321299 0.0054428 -0.062494 0.0647286 -0.0870606 -0.0826079 -0.1499733 -0.092832 -0.0439334 -0.0655806 0.0126612 -0.0141386 0.0013293 0.0133745 0.0772319 -0.1499359 0.0928732 -0.0439242 0.0656199 0.0126229 0.0141455 0.0013303 -0.0133787 0.0772321 0.0380691 -0.0691068 0.1116181 -0.0321411 0.0054583 0.0624729 0.0647471 0.0870505 -0.0826 0.0538026 0.0620901 0.0370549 0.0348359 -0.100378 -0.0763028 0.0496121 -0.1220489 0.0137105 0.0257008 0.018001 -0.0734251 -0.0148118 0.0707705 -0.0001686 -0.0714666 0.0482358 -0.1073391 0.0256997 -0.0179857 -0.0734259 0.0148268 0.0707742 0.0001957 -0.071477 -0.0482087 -0.1073412 0.0537789 -0.0621301 0.0370702 -0.0348763 -0.1003658 0.0762879 0.0496401 0.1220312 0.013721 0.2245069 -0.0000075 -0.2923622 -0.0000112 0.0962885 0.0000353 -0.1476266 0.000018 0.0790996 -0.0272236 0.0000071 -0.0506975 0.0000069 0.0222354 0.0000096 -0.0376672 0.0000079 -0.1004159 unknown
polarizability: 104.5004085|-0.0029283|79.9061102|-0.4651803|0.0002398|73.0438385 unknown
InChI: InChI=1S/C7H12ClN/c8-5-3-6-1-2-7(4-5)9-6/h5-7,9H,1-4H2
charge 0 multiplicity 1
21 atoms
Cl -3.193458 0.000391 0.350932
N  1.179411 -0.000087 -1.253339
C  0.824076 1.166831 -0.393315
C  0.823798 -1.166968 -0.393378
C  1.542932 0.785353 0.935659
C  1.542745 -0.785735 0.935615
C  -0.731267 1.281933 -0.218683
C  -0.731573 -1.281701 -0.218755
C  -1.267408 0.000162 0.434213
H  1.213345 2.103364 -0.828994
H  1.21284 -2.103571 -0.829109
H  1.029547 1.212953 1.815402
H  2.57567 1.170649 0.925885
H  2.575391 -1.171278 0.925817
H  1.029261 -1.213263 1.815336
H  -0.998731 2.163649 0.392313
H  -1.194185 1.4143 -1.21572
H  -1.194523 -1.413903 -1.215798
H  -0.999252 -2.163385 0.392193
H  0.700632 -0.000005 -2.167633
H  -1.086154 0.00011 1.52076
