program: Gaussian 09
title: 000016927
version: EM64L-G09RevD.01
frameworkgroup: C1[X(C15H11NO4)]
method: RPBEPBE
basis: SDD
operation: Freq
keyword: #p
keyword: freq=noraman
keyword: PBEPBE/SDD
title: #p freq=noraman PBEPBE/SDD
converged: YES YES NO NO
title: Mulliken charges:
elementType: O O O O N C C C C C C C C C C C C C C C H H H H H H H H H H H
charge: -0.280445 -0.364974 -0.307198 -0.182674 -0.649311 0.229744 0.225983 0.267934 0.253984 -0.123930 -0.217419 0.080869 0.128813 0.203275 -0.578216 -0.380762 -0.384248 -0.232164 -0.229601 -0.528529 0.234926 0.288972 0.291221 0.234586 0.234760 0.333902 0.387654 0.352477 0.251672 0.229344 0.229356
chargesum: 0.00000
title: Mulliken charges with hydrogens summed into heavy atoms:
elementType: O O O O N C C C C C C C C C C C C C C C
charge: -0.280445 -0.012498 -0.307198 -0.182674 0.072245 0.229744 0.225983 0.267934 0.253984 -0.123930 -0.217419 0.080869 0.128813 0.203275 -0.343290 -0.091789 -0.093028 0.002423 0.005158 0.181842
polarizability: 3.44994549e+02 -3.78061055e+00 2.14151774e+02 -3.82151932e-02 -2.44367006e-02 7.44405522e+01
1716.lowfreq: -10.8110 0.0005 0.0007 0.0009 3.9598 4.4700 35.8141 54.3479 86.7485
frequency: 35.8091 54.3430 86.7463 121.9881 145.4967 160.2853 168.3908 189.6006 225.0124 231.8846 276.8247 287.0160 303.3442 343.3735 347.1596 362.1417 395.2113 411.3797 422.9474 436.1068 445.1611 448.5673 489.1739 508.2235 525.6348 568.4577 569.3613 629.0266 641.5263 668.5851 686.6260 717.3590 734.4682 752.8307 807.7127 810.6033 813.2100 822.9985 868.6474 879.2345 905.6969 937.3591 961.4779 998.0642 1013.8066 1015.9232 1036.3451 1083.3736 1101.1400 1115.1458 1151.4315 1160.2445 1169.9299 1173.7630 1186.5518 1245.5698 1271.0007 1287.1753 1311.7989 1346.3261 1388.2204 1396.3159 1408.9785 1437.6812 1443.3312 1460.1735 1466.6006 1469.9294 1471.5909 1521.6441 1538.3762 1548.8063 1576.7442 1593.6215 1610.9368 1629.4254 2969.6315 3062.5558 3130.3464 3132.1473 3135.7679 3149.4608 3162.6385 3170.8104 3287.4416 3525.1010 3624.6751
redmass: 5.6757 6.1319 4.3530 4.7199 5.8499 4.2008 6.2769 1.8529 4.2331 2.1747 3.1825 6.5027 6.4398 5.3672 1.1662 6.3889 7.6853 6.9875 3.5555 6.2570 9.1354 5.0552 8.0595 3.3286 6.7281 6.1271 1.2287 5.0591 6.2859 4.9994 5.2017 6.2460 2.6129 3.2594 6.2850 1.8796 1.7949 1.1328 2.6172 7.6104 6.0635 2.0585 6.9088 1.3873 1.3580 3.5267 2.0169 2.8567 2.5052 1.2586 1.9346 1.3874 1.1655 1.5949 2.0740 1.7268 2.5759 3.7399 3.6476 3.9155 7.2655 6.8748 3.2769 1.3180 2.7448 3.3194 1.0495 2.5031 1.1034 9.2813 4.4997 2.1385 5.5305 5.3230 6.7507 7.3662 1.0325 1.1046 1.0918 1.0861 1.0992 1.0905 1.0944 1.0994 1.0609 1.0657 1.0904
irintensity: 8.9859 0.7641 0.0256 2.4000 2.1241 3.2054 0.6824 0.4139 4.5058 0.7640 12.3037 1.1571 1.2796 6.2249 95.6720 0.3466 2.1857 33.5090 0.3873 8.0890 8.0105 4.5109 1.2753 0.0093 4.4801 17.9933 162.7620 23.1785 4.3474 9.9132 0.0062 6.8191 11.5230 26.9000 14.0407 93.6669 9.9812 90.6100 0.0631 11.2663 70.6947 0.1294 28.4413 5.1448 0.0321 29.6034 28.8300 14.4639 109.4850 0.0528 69.5558 24.0685 1.3571 160.6427 29.1297 24.5439 99.5343 497.2706 256.0542 65.7300 16.1208 37.5819 57.4039 26.5362 3.2729 133.8633 16.2052 0.5980 53.2709 10.3275 663.9000 16.6930 32.2734 13.0486 0.9815 7.9674 68.8372 38.4656 19.3770 4.9796 12.4252 12.7573 3.4836 34.6442 63.3517 27.7539 117.8779
temp: 298.150 k
press: 1.00000 atm
elementType: 8 8 8 8 7 6 6 6 6 6 6 6 6 6 6 6 6 6 6 6 1 1 1 1 1 1 1 1 1 1 1
symmnumber: 1
zpe: 599194.8 jmol-1
zpe.correction: 0.228221 hartree
zpe.thermalcorrener: 0.244640 hartree
zpe.thermalcorrenthalpy: 0.245584 hartree
zpe.thermalcorrgfe: 0.184774 hartree
zpe.sumelectzpe: -932.466700 hartree
zpe.sumelectthermal: -932.450282 hartree
zpe.sumelectthermalent: -932.449337 hartree
zpe.sumelectthermalfe: -932.510148 hartree
dipole: 6.2666 -0.6231 0.0127
dipole: 6.2975
quadrupole: -66.9976 -120.6681 -118.6429
quadrupole: 10.1138 -0.0338 -0.1051
quadrupole: 35.1053 -18.5653 -16.5400 10.1138 -0.0338 -0.1051
hfenergy: -932.6949215 hartree
pointgroup: C01 [X(C15H11N1O4)]
dipole: 2.4583452 0.2834532 -0.1215781 debye
polarizability: 344.0467519|6.4062935|213.4891139|-14.638953|10.2956911|76.0510087 unknown
InChI: InChI=1S/C15H11NO4/c1-20-10-6-9(17)11-12(13(10)16)15(19)8-5-3-2-4-7(8)14(11)18/h2-6,17H,16H2,1H3
charge 0 multiplicity 1
31 atoms
O  4.127213 1.10135 -0.261748
O  1.41686 -2.989714 -0.424776
O  -0.61997 2.779726 0.141687
O  -1.206453 -2.712212 -0.247149
N  1.95251 2.595687 -0.023542
C  0.463212 0.623808 -0.087475
C  0.324245 -0.818405 -0.191127
C  -2.063788 0.864454 0.071933
C  -2.209005 -0.545541 -0.028658
C  -0.718411 1.491463 0.046874
C  -1.021813 -1.453614 -0.162559
C  1.759208 1.241678 -0.114487
C  1.502589 -1.599139 -0.319432
C  2.920975 0.395361 -0.246787
C  2.792214 -0.988027 -0.34684
C  -3.213225 1.68745 0.197068
C  -3.505663 -1.118094 -0.002493
C  -4.496519 1.110916 0.221996
C  -4.643087 -0.297929 0.121843
C  5.371452 0.336094 -0.39003
H  3.680453 -1.622641 -0.448637
H  -3.066057 2.769101 0.271714
H  -3.585038 -2.206841 -0.081349
H  -5.382541 1.747879 0.318345
H  -5.642565 -0.746091 0.141519
H  2.902241 2.960964 -0.05524
H  1.097744 3.170051 0.068266
H  2.324877 -3.383727 -0.496146
H  6.1755 1.085392 -0.376472
H  5.393572 -0.222094 -1.345143
H  5.494274 -0.361407 0.460243
