program: Gaussian 09
title: 000203453
version: EM64L-G09RevD.01
frameworkgroup: C1[X(C16H26N2O)]
method: RPBEPBE
basis: SDD
operation: Freq
keyword: #p
keyword: freq=noraman
keyword: PBEPBE/SDD
title: #p freq=noraman PBEPBE/SDD
converged: YES YES NO NO
title: Mulliken charges:
elementType: O N N C C C C C C C C C C C C C C C C H H H H H H H H H H H H H H H H H H H H H H H H H H
charge: -0.276453 -0.159930 -0.344923 -0.232772 -0.469160 0.555831 -0.313924 -0.328409 0.501778 -0.537267 0.189320 -0.465327 -0.404331 -0.448399 -0.390527 -0.693541 -0.691978 -0.668564 -0.672388 0.206645 0.236046 0.236470 0.205264 0.194986 0.228474 0.197307 0.219364 0.258060 0.230807 0.227854 0.227575 0.244928 0.226005 0.211660 0.211088 0.211118 0.210870 0.228210 0.340154 0.212703 0.225808 0.212633 0.210908 0.218558 0.217471
chargesum: 0.00000
title: Mulliken charges with hydrogens summed into heavy atoms:
elementType: O N N C C C C C C C C C C C C C C C C
charge: -0.276453 -0.159930 -0.004769 -0.026127 0.003356 0.555831 0.086325 0.097372 0.501778 -0.059842 0.189320 -0.234521 -0.176477 -0.220825 -0.145599 -0.044789 -0.041781 -0.017420 -0.025450
polarizability: 2.32599602e+02 -1.90595266e+01 1.66307670e+02 -7.55411445e+00 -7.23215394e+00 1.75852465e+02
1716.lowfreq: -6.9840 -4.8424 -0.0007 -0.0006 0.0004 6.7533 11.4428 15.8933 23.7782
frequency: 9.7971 15.5067 23.5632 36.0981 50.9924 59.8013 66.6658 83.6964 93.2386 123.3166 165.9738 191.8573 198.9829 211.4574 222.2996 224.6918 251.1383 260.9081 282.8563 291.0936 301.7785 332.1688 370.8302 393.2140 406.7503 417.5063 444.4647 475.6174 510.4662 528.1312 560.1121 580.7859 633.4852 650.7862 704.0544 749.6690 760.8530 787.0295 797.2106 806.8184 811.4515 843.1538 850.2606 860.8477 889.4904 899.9711 917.8862 953.6346 955.1765 974.5672 986.3985 992.6363 1010.5959 1020.1456 1052.3853 1065.7371 1074.6442 1077.8427 1086.8214 1111.6866 1112.5694 1115.1662 1155.3163 1158.0381 1190.6432 1198.6854 1206.8849 1217.5580 1220.6546 1244.3485 1248.6806 1279.0664 1288.7497 1291.5871 1308.0910 1326.4634 1329.0793 1352.9581 1362.8021 1371.5019 1377.8452 1387.7278 1393.2312 1394.3606 1397.0395 1414.0207 1447.1485 1465.3969 1466.5759 1467.0287 1469.2137 1469.4211 1473.7048 1478.0426 1479.7381 1483.2729 1484.5824 1486.4676 1493.2268 1508.1432 1584.6090 1623.3392 1623.6105 2880.1351 2887.3666 2942.5884 2973.2811 2976.5243 2978.7330 2979.9201 2984.9192 2985.4010 3028.0483 3035.8456 3042.1895 3044.9910 3066.2081 3073.3797 3076.4913 3078.2228 3081.0249 3081.4499 3086.6930 3091.3161 3106.3844 3116.4349 3130.0544 3142.3394 3402.3348
redmass: 3.6555 3.5696 3.3802 3.2324 3.8888 3.0685 3.4862 2.1872 2.2392 2.2557 3.4876 2.7373 1.5502 1.6040 1.1769 2.5747 1.1532 2.2140 3.0872 2.0321 2.7737 2.3203 2.6890 3.4197 2.8114 3.1915 2.6275 3.2566 3.5375 3.0323 2.8646 3.3077 5.9394 3.5200 3.1475 3.2239 2.5520 1.1438 1.1677 1.2695 3.3339 1.7276 1.2837 2.8806 2.5626 2.0121 1.1826 1.3566 1.4860 1.3782 1.9026 2.2577 2.9061 2.3037 1.5541 2.5027 1.9046 4.7060 2.1202 1.9260 2.5450 1.5459 1.7306 1.7076 1.1209 2.0919 1.9142 2.6848 2.0083 1.2783 1.3746 1.1922 1.2033 1.6662 1.3222 1.4315 1.4712 1.3197 1.3367 1.3574 1.1962 3.7981 1.2334 1.2321 1.2741 2.3763 1.0857 1.1312 1.0772 1.0444 1.0539 1.0749 1.0851 1.0555 1.0482 1.0949 1.1095 1.4324 1.2188 2.3382 6.4516 6.7146 8.0079 1.0718 1.0710 1.0677 1.0350 1.0380 1.0810 1.0597 1.0360 1.0359 1.0892 1.1018 1.0884 1.0919 1.1000 1.0992 1.1004 1.0984 1.0982 1.0997 1.1004 1.1005 1.0869 1.0869 1.0962 1.0965 1.0773
irintensity: 0.6485 0.1533 0.5715 0.0279 0.2564 1.9473 4.8702 2.2113 0.9400 2.5002 0.1867 0.4821 2.1676 5.2536 0.3286 1.7494 0.3621 6.4442 2.6043 1.8635 5.2072 2.4207 3.7955 1.3756 0.5049 15.2860 1.5472 2.1168 6.0689 11.1977 18.6871 15.8520 1.9353 4.4877 2.4313 6.4483 7.8006 76.0194 10.4491 28.6915 14.0489 39.5151 2.5550 6.8614 2.3973 6.0447 3.0053 0.5599 0.0411 0.3423 7.8041 6.1376 3.7780 10.5947 40.9831 23.9447 20.0676 2.5234 4.5052 19.7831 1.4586 16.4645 1.0946 14.5568 1.3792 34.6587 4.4616 3.2071 1.9407 47.3988 17.4028 9.9221 17.8747 8.3602 0.8722 4.2596 5.0001 12.1468 2.8277 10.1403 15.7094 7.5445 22.1179 14.5031 9.3591 15.7463 18.1696 38.4250 10.9595 2.1964 7.9002 10.2562 44.7740 7.5431 16.6000 24.6432 18.6254 72.6196 112.1511 41.4318 0.4906 52.9990 214.1295 28.0726 170.6520 58.7286 31.4071 36.8849 16.4952 45.7453 27.8317 19.4450 9.6413 13.0900 8.1161 16.0684 3.0142 105.5859 26.9047 39.2582 57.4270 39.1235 57.6261 36.9394 15.4383 16.8889 35.9718 5.7954 139.6716
temp: 298.150 k
press: 1.00000 atm
elementType: 8 7 7 6 6 6 6 6 6 6 6 6 6 6 6 6 6 6 6 1 1 1 1 1 1 1 1 1 1 1 1 1 1 1 1 1 1 1 1 1 1 1 1 1 1
symmnumber: 1
zpe: 1026574.6 jmol-1
zpe.correction: 0.391002 hartree
zpe.thermalcorrener: 0.412683 hartree
zpe.thermalcorrenthalpy: 0.413627 hartree
zpe.thermalcorrgfe: 0.336254 hartree
zpe.sumelectzpe: -808.555512 hartree
zpe.sumelectthermal: -808.533831 hartree
zpe.sumelectthermalent: -808.532886 hartree
zpe.sumelectthermalfe: -808.610259 hartree
dipole: 0.5220 3.4743 2.8094
dipole: 4.4985
quadrupole: -101.5975 -123.3279 -117.9600
quadrupole: 6.2295 4.6534 -11.3413
quadrupole: 12.6977 -9.0328 -3.6649 6.2295 4.6534 -11.3413
hfenergy: -808.9465132 hartree
pointgroup: C01 [X(C16H26N2O1)]
dipole: 0.599627 1.0563883 -1.2871679 debye
polarizability: 220.6824386|-16.9571714|179.9472074|28.7126331|1.2702776|174.130091 unknown
InChI: InChI=1S/C16H26N2O/c1-5-18(6-2)12-16(19)17-11-14-7-9-15(10-8-14)13(3)4/h7-10,13,17H,5-6,11-12H2,1-4H3
charge 0 multiplicity 1
45 atoms
O  1.462731 -2.677088 2.646358
N  3.60384 -1.050951 0.100549
N  1.315264 -0.647793 1.478899
C  -4.574476 0.725265 -1.291952
C  3.055619 -2.228409 0.820939
C  -3.349769 0.508401 -0.398317
C  4.083917 -1.365959 -1.275945
C  4.614027 -0.32668 0.930425
C  -1.059213 0.107921 1.284403
C  0.145913 -0.117655 2.192789
C  1.874864 -1.873752 1.751963
C  -2.817302 1.567696 0.375872
C  -2.712267 -0.759672 -0.315394
C  -1.687792 1.372199 1.205135
C  -1.587743 -0.957397 0.509745
C  -4.240222 0.487631 -2.788977
C  -5.769291 -0.160175 -0.846946
C  2.933131 -1.599884 -2.272058
C  4.803871 1.143773 0.514827
H  -4.88321 1.784799 -1.181921
H  3.814647 -2.758808 1.437321
H  2.672368 -2.965303 0.091627
H  4.682083 -0.505487 -1.62498
H  4.769834 -2.248458 -1.270389
H  4.256348 -0.354869 1.976583
H  5.597289 -0.857728 0.914538
H  0.411796 0.830509 2.69982
H  -0.08792 -0.863606 2.976916
H  -3.290861 2.556534 0.329228
H  -3.103205 -1.602525 -0.898537
H  -1.295115 2.21043 1.795144
H  -1.113295 -1.944543 0.565054
H  -3.409963 1.136878 -3.12067
H  -5.121618 0.698462 -3.423102
H  -3.940035 -0.561932 -2.966995
H  -5.526836 -1.234406 -0.949198
H  -6.659942 0.045446 -1.469734
H  -6.032903 0.026731 0.209522
H  1.769918 -0.137331 0.706782
H  2.303462 -2.462393 -1.98709
H  2.28356 -0.708698 -2.324224
H  3.336063 -1.802652 -3.281566
H  5.193825 1.243147 -0.51394
H  3.843489 1.686767 0.569704
H  5.523619 1.639365 1.19199
