program: Gaussian 09
title: 000203493
version: EM64L-G09RevD.01
frameworkgroup: C1[X(C22H20Cl2O6)]
method: RPBEPBE
basis: SDD
operation: Freq
keyword: #p
keyword: freq=noraman
keyword: PBEPBE/SDD
title: #p freq=noraman PBEPBE/SDD
converged: YES YES NO NO
title: Mulliken charges:
elementType: Cl Cl O O O O O O C C C C C C C C C C C C C C C C C C C C C C H H H H H H H H H H H H H H H H H H H H
charge: -0.081194 -0.078097 -0.280207 -0.277154 -0.251487 -0.253800 -0.214709 -0.214174 0.343963 0.344759 0.246675 0.250418 -0.370505 -0.351985 -0.372717 -0.340881 -0.802057 -0.801946 -0.102185 -0.100087 -0.171952 -0.236290 -0.406041 -0.412184 0.285393 0.279705 -0.390829 -0.388599 0.045044 0.072331 0.260742 0.269454 0.239065 0.230551 0.211204 0.237599 0.282377 0.275496 0.223236 0.234786 0.258546 0.254112 0.264565 0.241858 0.235863 0.269208 0.251984 0.263316 0.273719 0.253107
chargesum: 0.00000
title: Mulliken charges with hydrogens summed into heavy atoms:
elementType: Cl Cl O O O O O O C C C C C C C C C C C C C C C C C C C C C C
charge: -0.081194 -0.078097 -0.280207 -0.277154 -0.251487 -0.253800 -0.214709 -0.214174 0.343963 0.344759 0.246675 0.250418 -0.109763 -0.082530 -0.133652 -0.110330 -0.070877 -0.068428 -0.102185 -0.100087 0.086594 0.017823 0.100383 0.092887 0.285393 0.279705 0.124471 0.138228 0.045044 0.072331
polarizability: 2.67021458e+02 1.83188644e+01 2.70989899e+02 2.07063745e+01 -3.26014494e+00 2.62873022e+02
1716.lowfreq: -3.9229 -2.1527 -0.0025 -0.0016 -0.0013 3.9222 10.4972 13.9899 21.2679
frequency: 10.4553 13.5695 21.2603 22.1888 29.6927 38.1267 39.6298 40.7789 50.8381 53.5763 59.3093 94.2577 99.1697 136.6137 140.3981 148.0119 152.9227 171.4444 179.2706 190.2426 193.2400 203.9548 207.8852 231.4835 232.3995 255.9641 270.1799 285.2462 294.0235 300.2443 305.4018 328.6191 336.4752 363.3886 372.3130 400.6932 418.6350 435.9055 437.0899 466.4618 476.3301 498.5152 517.1160 529.5834 537.0259 546.4782 560.2263 568.8449 594.5930 616.5492 623.1226 643.0392 649.9909 709.1737 709.2658 730.8634 732.6176 780.1825 802.6748 809.9957 815.3148 820.4182 850.0105 852.8430 874.3369 881.4647 883.4038 897.0016 926.1464 935.6035 993.2021 999.1254 999.5750 1000.4874 1001.6922 1003.1690 1012.2868 1014.9677 1053.7197 1054.2768 1081.3857 1084.0594 1085.1386 1098.7231 1120.8502 1121.5370 1170.5854 1173.4647 1179.4085 1218.2811 1218.6130 1236.6197 1238.1603 1239.5022 1247.7368 1260.1256 1263.3728 1329.7558 1335.4908 1346.6840 1348.2343 1371.5577 1373.0454 1388.8555 1390.1478 1402.9155 1405.0428 1431.6430 1436.5175 1436.9804 1440.1920 1459.5930 1460.0589 1467.3816 1467.7166 1481.3116 1482.5380 1581.9853 1583.2005 1600.2200 1600.6565 1670.9343 1673.2845 2287.3149 2986.3833 2989.7417 3006.1034 3012.2522 3015.6603 3018.4273 3069.9041 3074.0340 3078.4512 3082.9608 3090.7357 3094.4936 3097.1340 3102.2934 3141.2451 3144.1626 3154.8260 3158.6634 3174.2444 3176.4390
redmass: 7.3921 7.2113 8.3864 6.5278 6.4798 6.8745 6.5082 7.2753 6.9783 5.1166 10.4485 6.6838 6.0961 7.0008 1.1434 2.8762 1.3858 3.8429 3.5544 3.3436 3.3927 3.6474 3.4445 3.8963 3.8275 4.8623 5.7265 7.0536 5.1015 4.1715 4.0550 6.8664 4.2197 8.6762 7.9308 4.8337 4.7036 3.0778 3.1836 3.5963 3.5292 5.6927 4.1340 4.1180 4.8431 4.4252 3.9330 3.7427 5.8982 6.8516 7.2291 5.8068 5.7938 3.8358 3.8497 4.2268 4.2977 5.0643 1.5135 1.4658 5.9340 5.5636 6.0264 5.9722 1.3599 6.9838 1.3464 6.7376 1.3534 1.3392 2.0656 2.0735 1.5962 1.7739 3.0277 2.6869 3.1327 3.8500 1.5136 1.5220 2.3331 2.3759 2.3227 4.0993 2.1712 2.1907 2.0662 1.8686 4.1346 1.9163 2.0660 1.2217 1.1246 1.2746 1.4235 1.3202 1.3180 1.2747 1.2536 1.4226 1.3084 8.0484 7.6826 3.1658 3.1113 1.2402 1.2367 1.0990 1.0981 1.0998 1.0854 1.0957 1.1086 2.0888 2.2832 1.2075 1.1837 6.2049 6.2587 7.8712 7.7866 10.0248 10.1751 11.7428 1.0366 1.0366 1.0614 1.0577 1.0601 1.0584 1.0966 1.0968 1.1032 1.0992 1.1039 1.1021 1.1007 1.1007 1.0889 1.0892 1.0930 1.0925 1.0962 1.0962
irintensity: 0.0611 0.2605 0.1606 0.7548 0.1366 0.6367 0.2482 0.0985 0.6370 2.9907 1.9253 2.8660 1.4289 0.1144 0.3018 1.8426 0.9200 1.5441 4.9332 1.6527 0.7777 1.8081 11.9383 5.5061 2.4989 5.7416 5.3876 4.9640 0.4956 10.3954 10.7959 6.5366 26.0675 6.7939 2.8283 3.9027 11.5478 6.1098 7.7942 17.4378 3.4977 0.0910 10.9402 0.2715 0.8390 5.5443 8.1382 5.0519 0.8134 24.5183 37.1005 10.4775 19.9197 0.3329 0.5688 3.5744 4.7611 9.8737 49.0615 43.6517 0.3360 6.7983 37.7399 29.7091 19.8744 67.8217 31.0035 51.4771 0.6901 3.5192 8.1305 0.4118 4.6716 2.5174 25.4613 71.7342 43.1029 113.1050 12.6120 23.0225 40.0744 71.5723 79.4787 556.5558 11.5143 78.2467 64.2962 91.7720 42.7821 2.3104 7.4946 28.1534 5.8085 9.5015 27.8328 0.4459 1.2681 20.0125 10.0026 10.7552 19.3835 1.7960 2.1330 13.6787 6.8299 21.9208 20.5305 16.9937 47.1317 4.0370 20.8836 20.5997 10.4365 56.8405 93.0496 69.1916 62.6111 0.9063 0.6522 6.7383 5.3499 68.1846 222.8145 0.3565 26.8759 19.9362 24.1686 25.4948 19.2332 15.4168 9.7338 9.2336 7.3658 6.9221 1.9657 3.1998 11.3384 8.6870 10.1840 8.9055 0.6732 1.9062 3.0301 1.1299
temp: 298.150 k
press: 1.00000 atm
elementType: 17 17 8 8 8 8 8 8 6 6 6 6 6 6 6 6 6 6 6 6 6 6 6 6 6 6 6 6 6 6 1 1 1 1 1 1 1 1 1 1 1 1 1 1 1 1 1 1 1 1
symmnumber: 1
zpe: 965958.0 jmol-1
zpe.correction: 0.367914 hartree
zpe.thermalcorrener: 0.398812 hartree
zpe.thermalcorrenthalpy: 0.399756 hartree
zpe.thermalcorrgfe: 0.299791 hartree
zpe.sumelectzpe: -2219.531751 hartree
zpe.sumelectthermal: -2219.500853 hartree
zpe.sumelectthermalent: -2219.499909 hartree
zpe.sumelectthermalfe: -2219.599874 hartree
dipole: 2.7196 6.0521 1.9210
dipole: 6.9075
quadrupole: -187.9569 -175.5566 -178.0119
quadrupole: 2.5005 6.0541 1.6190
quadrupole: -7.4485 4.9519 2.4966 2.5005 6.0541 1.6190
hfenergy: -2219.8996649 hartree
pointgroup: C01 [X(C22H20Cl2O6)]
dipole: -2.2342593 1.3025743 -0.8347846 debye
polarizability: 284.6782342|-8.1679152|252.1455946|15.6331401|14.4714333|264.0605503 unknown
InChI: InChI=1S/C22H20Cl2O6/c1-15-11-17(23)5-7-19(15)29-13-21(25)27-9-3-4-10-28-22(26)14-30-20-8-6-18(24)12-16(20)2/h5-8,11-12H,9-10,13-14H2,1-2H3
charge 0 multiplicity 1
50 atoms
Cl 3.468961 -2.255478 2.237368
Cl 4.296115 -0.234432 -2.504647
O  -1.347482 -3.880423 -1.020182
O  1.44602 4.008669 0.707351
O  -3.459836 -1.050721 -2.023075
O  -2.207526 3.599329 0.729739
O  -3.512924 -2.275555 -0.030133
O  -0.556902 2.267034 1.725534
C  -0.217995 -3.735533 1.119463
C  2.834062 2.029114 0.619914
C  -0.218848 -3.438214 -0.270937
C  2.059655 2.994058 -0.081676
C  0.929654 -3.369261 1.86665
C  3.522012 1.05653 -0.146846
C  0.885447 -2.823587 -0.901454
C  1.97839 3.001009 -1.491761
C  -1.40677 -4.411474 1.768633
C  2.892074 2.027525 2.131183
C  2.014915 -2.737068 1.23149
C  3.420909 1.063048 -1.550339
C  2.021409 -2.459882 -0.146402
C  2.66121 2.019935 -2.245011
C  -1.98243 -2.914858 -1.90012
C  0.051176 4.313326 0.443279
C  -3.04573 -2.083163 -1.166477
C  -0.884204 3.25725 1.047724
C  -4.556175 -0.165745 -1.501749
C  -3.265655 2.667847 1.255033
C  -4.070919 0.845015 -0.560037
C  -3.687022 1.695009 0.246278
H  0.961952 -3.571187 2.941574
H  4.113583 0.290646 0.364287
H  0.884017 -2.642509 -1.981642
H  1.405747 3.773696 -2.01575
H  -1.29405 -4.44379 2.865461
H  -1.523648 -5.44731 1.399809
H  -2.338929 -3.877453 1.513513
H  1.868237 2.008672 2.544042
H  3.44491 1.149562 2.504234
H  3.377883 2.943302 2.51471
H  2.87962 -1.986127 -0.630186
H  2.608267 2.012996 -3.337039
H  -2.484429 -3.496147 -2.693436
H  -1.264959 -2.224197 -2.380141
H  -0.180381 4.415128 -0.633914
H  -0.148309 5.284724 0.926384
H  -4.968055 0.289262 -2.416769
H  -5.320126 -0.800187 -1.014725
H  -2.863635 2.154844 2.147912
H  -4.096188 3.334973 1.538583
