program: Gaussian 09
title: 000016926
version: EM64L-G09RevD.01
frameworkgroup: C1[X(C18H10Cl2O2S2)]
method: RPBEPBE
basis: SDD
operation: Freq
keyword: #p
keyword: freq=noraman
keyword: PBEPBE/SDD
title: #p freq=noraman PBEPBE/SDD
converged: NO NO NO NO
title: Mulliken charges:
elementType: Cl Cl S S O O C C C C C C C C C C C C C C C C C C H H H H H H H H H H
charge: -0.033417 -0.033417 0.228958 0.228955 -0.157052 -0.157052 0.328869 0.328871 -0.135792 -0.135790 -0.313556 -0.313557 0.029012 0.029013 0.378233 0.378226 -0.311079 -0.311078 -0.407308 -0.407307 -0.102308 -0.102308 -0.788654 -0.788650 0.278184 0.278184 0.267727 0.267727 0.220296 0.258937 0.258951 0.258947 0.220296 0.258939
chargesum: 0.00000
title: Mulliken charges with hydrogens summed into heavy atoms:
elementType: Cl Cl S S O O C C C C C C C C C C C C C C C C C C
charge: -0.033417 -0.033417 0.228958 0.228955 -0.157052 -0.157052 0.328869 0.328871 -0.135792 -0.135790 -0.313556 -0.313557 0.029012 0.029013 0.378233 0.378226 -0.032895 -0.032894 -0.139581 -0.139580 -0.102308 -0.102308 -0.050470 -0.050468
polarizability: 5.85771053e+02 7.59875413e-06 2.70787933e+02 -8.04824894e-02 2.17507999e-03 9.80616203e+01
1716.lowfreq: -30.4960 -12.6830 -5.8827 -0.0018 -0.0011 0.0013 4.0083 16.1983 49.2066
frequency: -30.4762 16.1906 49.2028 55.9080 60.4369 70.7234 143.0552 143.3905 147.6406 152.9849 155.8230 156.0226 212.3735 213.2686 216.0000 221.8213 230.1625 257.6203 272.7138 277.3959 294.4653 309.7339 330.9455 384.0133 407.2122 444.8724 452.6186 479.7274 486.2606 490.7792 494.2419 507.3852 523.4167 523.9769 536.3468 550.1227 602.7676 605.7192 660.9542 664.9992 688.0013 734.7223 774.6211 777.2020 796.4979 809.5741 858.7038 858.8713 870.0733 870.2627 887.0542 892.6930 929.5294 951.8786 1002.8124 1003.8201 1040.1579 1040.2324 1048.2355 1093.0050 1093.2927 1186.8709 1188.3460 1202.1576 1206.3352 1242.6839 1242.8404 1374.1688 1376.5940 1385.1753 1385.6062 1406.5540 1406.9992 1437.4988 1437.5759 1448.6556 1448.6914 1461.7260 1462.8904 1508.2700 1554.3874 1564.3804 1569.1981 1592.6844 1594.8505 1602.5290 2994.7215 2994.7413 3073.3704 3073.4305 3103.4696 3103.6382 3167.3094 3167.3231 3178.0007 3178.0092
redmass: 10.2530 13.9508 5.2748 12.0103 16.3077 8.8051 11.6296 6.1356 3.5648 1.0957 8.0715 1.2991 2.9566 3.0231 12.6140 6.1527 10.0703 7.0437 7.5611 3.8727 7.8858 10.0920 15.1748 7.3518 9.3064 12.2471 11.5654 10.3901 8.3465 7.9676 5.1090 4.5574 3.8289 3.7836 5.7240 5.1088 7.1542 7.3484 7.8373 4.1618 4.2193 11.1375 10.2245 7.4269 8.7462 9.2110 1.4191 1.4159 1.3392 1.3451 7.4050 7.1094 10.1526 7.6346 1.5428 1.5953 1.5840 1.5852 9.6623 1.7719 1.8080 2.5544 2.5424 6.3914 6.2241 1.7255 1.7467 3.1059 2.9226 6.0753 5.9137 1.2681 1.2927 3.6000 3.5932 1.0443 1.0443 1.1839 1.1760 10.9579 9.2291 8.5743 8.9404 8.2983 8.0550 10.3978 1.0367 1.0367 1.0951 1.0952 1.1018 1.1018 1.0926 1.0926 1.0940 1.0940
irintensity: 0.0000 0.3821 0.0000 0.1560 0.0000 5.2761 1.6196 1.3166 0.0000 1.5111 0.0051 0.0001 0.5564 0.0000 4.4106 0.0011 0.0157 0.0000 5.5658 0.0559 1.6683 6.0840 0.5787 0.0623 2.9889 110.8724 0.0333 0.0000 6.5890 0.4615 0.5062 1.6540 0.0000 0.1462 1.1016 0.0000 9.1175 0.0854 3.7296 32.6452 0.0000 19.8259 263.6033 0.4260 0.0000 0.0142 49.6078 0.0000 26.8602 0.0042 13.8655 1.6368 7.8048 3.0547 52.9049 0.2130 21.3558 0.0018 373.6224 4.3445 239.9762 12.6630 14.7752 3.4739 230.3842 0.4866 147.0082 13.4707 31.8993 15.7436 4.6640 50.0060 18.3058 8.3154 2.3746 0.0288 28.4475 173.2412 12.3838 251.7181 464.3928 3.7849 361.8889 3.9230 82.7137 178.8285 3.5916 12.0244 10.8291 0.0371 62.2245 20.3241 2.9130 1.3168 0.2425 0.3684
temp: 298.150 k
press: 1.00000 atm
elementType: 17 17 16 16 8 8 6 6 6 6 6 6 6 6 6 6 6 6 6 6 6 6 6 6 1 1 1 1 1 1 1 1 1 1
symmnumber: 1
zpe: 587044.7 jmol-1
zpe.correction: 0.223594 hartree
zpe.thermalcorrener: 0.244822 hartree
zpe.thermalcorrenthalpy: 0.245766 hartree
zpe.thermalcorrgfe: 0.172379 hartree
zpe.sumelectzpe: -2556.960824 hartree
zpe.sumelectthermal: -2556.939595 hartree
zpe.sumelectthermalent: -2556.938651 hartree
zpe.sumelectthermalfe: -2557.012038 hartree
dipole: 0.0000 -0.6617 -0.0001
dipole: 0.6617
quadrupole: -157.0672 -163.7114 -168.8932
quadrupole: 0.0000 0.0054 -0.0011
quadrupole: 6.1567 -0.4875 -5.6692 0.0000 0.0054 -0.0011
hfenergy: -2557.1844171 hartree
pointgroup: C01 [X(C18H10Cl2O2S2)]
dipole: -0.0000001 0.2603464 -0.0000266 debye
polarizability: 585.7710525|0.0009294|270.7879332|0.0804825|-0.0021748|98.0616203 unknown
InChI: InChI=1S/C18H10Cl2O2S2/c1-7-3-9(19)5-11-13(7)15(21)17(23-11)18-16(22)14-8(2)4-10(20)6-12(14)24-18/h3-6H,1-2H3
charge 0 multiplicity 1
34 atoms
Cl 7.197782 1.697003 0.001992
Cl -7.197776 1.696962 -0.002605
S  1.570053 1.866617 0.000239
S  -1.570051 1.86661 0.000195
O  1.37594 -2.121328 -0.002816
O  -1.375909 -2.121337 0.003183
C  3.085774 -0.386452 -0.000302
C  -3.085755 -0.386472 0.000516
C  0.691662 0.249842 -0.000059
C  -0.691647 0.249836 0.000555
C  3.191738 1.022773 0.000409
C  -3.191728 1.022752 -0.000223
C  1.687735 -0.898462 -0.001403
C  -1.687714 -0.898473 0.001958
C  4.266332 -1.189922 -0.000432
C  -4.26631 -1.189948 0.0004
C  4.418932 1.701909 0.00109
C  -4.418926 1.701882 -0.001142
C  5.516063 -0.520638 0.000322
C  -5.516047 -0.520671 -0.000595
C  5.570742 0.8876 0.001051
C  -5.570733 0.887567 -0.00133
C  4.21954 -2.701516 -0.001302
C  -4.219508 -2.701543 0.00126
H  4.491564 2.791858 0.001606
H  -4.49156 2.791831 -0.001688
H  6.443014 -1.100754 0.000335
H  -6.442993 -1.100793 -0.000795
H  5.236947 -3.125299 -0.000887
H  3.664632 -3.083697 0.873744
H  3.66577 -3.082686 -0.877507
H  -3.665913 -3.082719 0.877573
H  -5.236913 -3.125327 0.000647
H  -3.664437 -3.083707 -0.873689
