program: Gaussian 09
title: 000203396
version: EM64L-G09RevD.01
frameworkgroup: C1[X(C10H6Br2N2O)]
method: RPBEPBE
basis: SDD
operation: Freq
keyword: #p
keyword: freq=noraman
keyword: PBEPBE/SDD
title: #p freq=noraman PBEPBE/SDD
converged: YES YES YES YES
title: Mulliken charges:
elementType: Br Br O N N C C C C C C C C C C H H H H H H
charge: 0.132485 0.091829 -0.225176 -0.313532 0.048659 0.469039 0.321735 -0.324364 -0.357462 -0.298808 -0.223646 -0.211131 -0.073159 -0.238420 -0.332788 0.290892 0.269829 0.232968 0.232166 0.274876 0.234009
chargesum: 0.00000
title: Mulliken charges with hydrogens summed into heavy atoms:
elementType: Br Br O N N C C C C C C C C C C
charge: 0.132485 0.091829 -0.225176 -0.313532 0.048659 0.469039 0.321735 -0.033472 -0.087633 -0.298808 0.009321 0.021035 -0.073159 -0.004411 -0.057913
polarizability: 2.84905595e+02 4.30986512e+00 1.67829643e+02 -8.82074377e-01 9.24768255e+00 6.42751492e+01
1716.lowfreq: -4.4628 -0.0005 -0.0004 0.0003 2.4728 3.5087 31.3813 36.6718 72.4505
frequency: 31.3738 36.6687 72.4501 98.5758 120.3135 162.7917 212.7226 217.1577 239.2449 298.2320 322.2098 364.9013 401.0233 419.7435 477.5795 546.0459 567.1111 595.2660 607.4924 613.6828 665.1257 687.8282 723.3165 751.6431 771.8447 836.5070 855.7234 862.8220 921.2336 972.8343 988.4552 995.1468 1002.8427 1034.6617 1055.9296 1098.9277 1124.6567 1175.2595 1192.0851 1192.8850 1247.1056 1324.4916 1346.4135 1387.2225 1443.2814 1476.6388 1477.2528 1531.9512 1593.7076 1602.0430 1605.6215 3134.9524 3147.7938 3165.2315 3181.4561 3185.6206 3210.3696
redmass: 4.2622 8.6159 12.6402 7.1187 50.1755 6.0260 12.0919 8.6711 9.6825 6.6337 11.6448 6.8588 3.0238 6.9256 5.7401 5.1105 9.0919 7.5008 6.1618 6.5771 8.0072 1.9727 8.7359 6.6922 1.8996 1.2833 1.3307 8.0726 1.4119 1.3812 5.3796 1.3840 7.1823 2.1439 4.9971 1.9143 3.4870 1.0501 3.7941 1.2192 5.0593 1.3119 1.5927 9.7537 2.3885 2.2599 8.2180 8.5759 6.8174 10.3759 6.3924 1.0857 1.0910 1.0975 1.0927 1.0956 1.0948
irintensity: 0.0984 0.9895 1.5680 0.8157 0.0701 0.3652 4.8603 0.3647 0.1688 0.3864 1.2976 1.8489 1.7909 7.6856 2.5171 7.0497 5.2267 3.9358 9.9866 1.9830 29.6550 47.1242 0.7737 48.1913 59.3184 0.4524 18.4916 100.7651 4.8718 1.2513 0.7304 2.6330 60.2469 9.3072 54.9772 27.1660 9.7739 0.3181 70.6215 2.8001 15.3814 2.2276 2.4911 5.1487 14.6967 47.0134 38.4320 67.2269 32.2668 177.1630 25.8798 0.1593 17.4380 33.7036 0.2836 3.5591 2.4608
temp: 298.150 k
press: 1.00000 atm
elementType: 35 35 8 7 7 6 6 6 6 6 6 6 6 6 6 1 1 1 1 1 1
symmnumber: 1
zpe: 361125.5 jmol-1
zpe.correction: 0.137545 hartree
zpe.thermalcorrener: 0.150541 hartree
zpe.thermalcorrenthalpy: 0.151485 hartree
zpe.thermalcorrgfe: 0.094778 hartree
zpe.sumelectzpe: -595.231720 hartree
zpe.sumelectthermal: -595.218724 hartree
zpe.sumelectthermalent: -595.217780 hartree
zpe.sumelectthermalfe: -595.274488 hartree
dipole: 0.9533 -2.5596 0.2500
dipole: 2.7428
quadrupole: -87.8149 -103.5212 -106.2100
quadrupole: -0.5446 -0.0529 4.3663
quadrupole: 11.3671 -4.3391 -7.0280 -0.5446 -0.0529 4.3663
hfenergy: -595.3692658 hartree
pointgroup: C01 [X(C10H6Br2N2O1)]
dipole: -0.3716564 -1.0034151 -0.1394494 debye
dipolederiv: -0.2096304 -0.3452763 -0.0436131 -0.3592632 -0.3326694 -0.0516481 -0.0601869 -0.0492513 0.0569635 -0.8338417 0.331102 0.0258952 0.2702123 -0.0773495 -0.0090796 0.0327326 -0.0057264 0.0287863 -0.4971412 0.3024119 0.0542595 0.2341078 -1.0054698 -0.1050579 -0.0008815 -0.0896003 -0.3265719 -0.1500617 -0.3320836 -0.0466615 0.848982 -0.3620783 0.0218745 0.0431191 -0.0316015 -0.0506094 0.0912602 -0.0530585 -0.0044666 -1.0347823 -0.0684254 -0.0194232 0.0542424 -0.0118687 -0.1058647 0.6178788 0.040146 0.0029519 -0.1581389 0.008174 -0.0610706 -0.0634164 -0.0234741 0.0609989 0.389341 -0.4589946 -0.0599412 -0.4017359 1.0386617 0.1347199 -0.0332098 0.099708 0.2813519 -0.0851261 0.074037 -0.0281453 -0.0599137 -0.0500123 -0.0341611 0.0255645 0.0063975 -0.1060679 -0.0473745 -0.0903032 0.012665 0.0579184 -0.032513 -0.0324119 -0.0190418 -0.020934 -0.1211144 0.0885018 1.0527611 0.1353293 0.5800323 0.4432123 0.0660256 0.097596 0.0852122 -0.1175515 -0.0651144 -0.1164287 0.0383234 -0.139148 0.0743827 -0.0936782 0.0863666 -0.0725813 -0.1199793 -0.1092978 0.1106828 -0.0443184 0.1967468 0.0494225 -0.0908234 -0.0775375 -0.0830516 -0.1180699 1.2998502 -0.6715393 -0.0585229 -0.1618927 0.0392904 0.0108117 -0.0252519 0.0016698 -0.0226851 0.0657902 -0.0157882 -0.0069751 -0.0484856 -0.046537 -0.0327262 0.023588 -0.0435021 -0.1325587 -0.7238795 0.1394602 0.0080658 0.1387157 0.1487864 0.014241 -0.0539072 0.0251139 -0.0447952 0.1391329 -0.0618638 0.0281972 -0.0516999 0.0702774 0.0504728 0.0439935 0.0160444 0.1451703 0.1155787 0.0688461 -0.0270492 0.0626329 0.0386424 0.0606059 -0.0650771 0.0412046 0.1426876 0.0169772 0.0618521 -0.027731 0.0970512 -0.0317306 0.0809499 -0.0398551 0.0743808 0.1245421 -0.0011573 -0.0749789 0.035213 -0.1035952 -0.0216682 0.0785102 0.0409806 0.076421 0.1228784 0.0374307 0.0276407 0.0032254 0.0231966 0.0124921 -0.0130986 -0.006196 -0.0149805 0.1488199 -0.1391171 0.0113753 0.0032986 0.0090594 0.1051115 0.0249673 -0.003622 0.0204195 0.153669 unknown
polarizability: 284.9164753|-3.9952505|168.3529992|1.4504113|-5.4708974|63.7409123 unknown
InChI: InChI=1S/C10H6Br2N2O/c11-8-6-13-14(10(15)9(8)12)7-4-2-1-3-5-7/h1-6H
charge 0 multiplicity 1
21 atoms
Br 3.543793 2.081831 0.269694
Br 4.641024 -1.261017 -0.078828
O  0.45669 2.098151 0.226664
N  0.037011 -0.22414 -0.062085
N  0.47657 -1.527157 -0.173298
C  -1.41481 -0.097198 -0.042758
C  0.906717 0.929441 0.09185
C  -2.062951 1.069064 -0.519721
C  -2.174501 -1.193932 0.436797
C  2.347849 0.58941 0.081545
C  -3.473707 1.126801 -0.50663
C  -3.581294 -1.118439 0.445664
C  2.773779 -0.722676 -0.046534
C  -4.239409 0.042053 -0.024693
C  1.7886 -1.761637 -0.166446
H  -1.483188 1.919094 -0.878867
H  -1.659352 -2.091625 0.78596
H  -3.971399 2.029446 -0.876513
H  -4.162437 -1.966337 0.823643
H  2.080586 -2.809514 -0.265664
H  -5.333071 0.099479 -0.013377
