program: Gaussian 09
title: 000203413
version: EM64L-G09RevD.01
frameworkgroup: C1[X(C19H25NO)]
method: RPBEPBE
basis: SDD
operation: Freq
keyword: #p
keyword: freq=noraman
keyword: PBEPBE/SDD
title: #p freq=noraman PBEPBE/SDD
converged: YES YES NO NO
title: Mulliken charges:
elementType: O N C C C C C C C C C C C C C C C C C C C H H H H H H H H H H H H H H H H H H H H H H H H H
charge: -0.455339 -0.086475 -0.059626 -0.008126 -0.420622 0.374792 0.497291 -0.766873 -0.305526 -0.382220 -0.436149 -0.432137 -0.392435 -0.640784 -0.706679 -0.239923 -0.261312 -0.231129 -0.245993 -0.242907 -0.244062 0.191039 0.229821 0.227558 0.242207 0.238613 0.228236 0.332914 0.169603 0.215735 0.249075 0.252830 0.267021 0.190735 0.219183 0.231263 0.189028 0.226263 0.215796 0.209712 0.224362 0.227783 0.224644 0.225012 0.227902 0.229901
chargesum: 0.00000
title: Mulliken charges with hydrogens summed into heavy atoms:
elementType: O N C C C C C C C C C C C C C C C C C C C
charge: -0.122425 -0.086475 0.131413 -0.008126 0.036756 0.374792 0.497291 -0.057816 0.079812 -0.133145 -0.183319 -0.165116 -0.201699 -0.001310 -0.054909 -0.015561 -0.033529 -0.006485 -0.020981 -0.015005 -0.014162
polarizability: 2.28935446e+02 1.39674097e+01 2.13820797e+02 8.45921206e+00 1.05809777e+01 1.85780213e+02
1716.lowfreq: -27.4890 -7.4279 -0.0006 -0.0005 -0.0004 4.3585 7.0572 32.7587 39.6091
frequency: -27.2299 32.3994 39.4538 44.2984 54.7598 62.1002 85.9961 111.8759 141.0433 180.1452 199.7070 206.1057 208.1187 214.9743 222.3713 244.9334 255.3475 283.9769 297.0992 304.3369 326.9569 347.7005 359.0528 398.2855 402.2282 406.9888 425.9761 475.5505 486.1480 528.8056 541.7901 616.0569 616.8337 629.8523 636.1022 701.1213 701.6490 709.7522 756.5875 769.1514 789.1306 803.4388 841.7677 857.6873 864.9912 885.7836 902.2950 915.2586 926.9659 938.0532 955.4872 969.3937 975.1789 980.9280 989.8311 990.7976 994.7109 998.4936 1028.1870 1031.0694 1038.8269 1066.2621 1071.8251 1086.3839 1088.7463 1094.0279 1102.3921 1130.1634 1132.3258 1166.7701 1171.2512 1173.9771 1187.6312 1192.5845 1195.7196 1204.5181 1220.1381 1259.5149 1279.9475 1293.6902 1302.4918 1312.0713 1321.6452 1324.7964 1343.7468 1372.5154 1376.2977 1378.2701 1382.1695 1390.8241 1430.5191 1432.1172 1434.1420 1462.5775 1466.0251 1473.7828 1475.7609 1476.5190 1477.7472 1483.7241 1485.7875 1488.4681 1493.0915 1588.6223 1590.5248 1606.5455 1611.4133 2827.9391 2852.3900 2910.7615 2982.5282 2985.1389 2991.8095 3017.4271 3032.8605 3049.0351 3078.7331 3084.9064 3089.0917 3090.8288 3094.6992 3099.3325 3120.9954 3124.8357 3128.6234 3137.0878 3142.5117 3149.6534 3150.5858 3163.3343 3164.1976 3562.8707
redmass: 3.2607 3.1813 3.6047 3.7770 3.0495 4.4132 2.8624 2.1229 3.0462 2.5266 1.4637 1.4990 2.1851 1.3551 1.8305 3.7028 1.7238 4.7265 2.4672 2.7494 3.1117 5.4455 2.5757 1.9335 2.7710 2.8366 3.7074 3.1074 2.8472 3.1997 3.6612 6.4086 6.3846 5.1630 4.2766 4.6473 1.6246 1.7293 1.9041 2.2251 3.1594 1.1245 1.2890 1.2501 2.5906 2.6775 1.6560 1.9378 1.5642 2.1167 2.2079 1.7581 1.4613 1.5774 4.9595 3.8653 1.3241 1.3576 2.2312 2.2413 1.9495 2.1604 2.4765 1.6245 1.4749 1.7232 1.5922 1.8417 2.1841 2.7875 1.0932 1.0600 1.5243 1.7729 1.6642 1.4829 1.9389 1.4518 1.4482 1.2967 1.4890 1.3548 1.4083 1.3210 1.3514 1.2649 4.9094 5.0818 1.4150 1.2961 2.1786 1.1990 2.1588 1.0667 1.0456 1.1287 1.2792 1.4598 1.0634 1.9740 1.0902 1.0664 1.0625 6.1210 5.9403 6.0508 6.0610 1.0711 1.0577 1.0685 1.0811 1.0355 1.0351 1.0875 1.0714 1.0911 1.0990 1.1001 1.1000 1.0995 1.0997 1.0878 1.0843 1.0854 1.0875 1.0912 1.0919 1.0944 1.0949 1.1012 1.1011 1.0655
irintensity: 5.2751 0.0659 0.1664 1.0753 0.3428 1.0871 0.2376 0.5400 6.2165 0.8589 0.6181 2.2179 40.3901 57.4249 30.6396 15.9078 1.2587 3.8419 7.2488 5.6621 1.2889 8.8630 8.6238 0.5113 1.5602 2.9335 9.1708 2.0747 2.8421 7.6250 7.1795 0.0855 0.1764 17.0938 19.1137 4.5309 59.2380 59.1234 47.7571 30.9127 18.4369 4.4481 1.0798 0.2486 8.0134 7.5141 10.8623 9.3949 9.2650 41.9432 7.6628 17.7662 6.8144 0.3890 1.9156 0.7154 0.5894 0.3724 9.3737 2.0704 93.7244 15.9474 1.0522 2.1198 7.6248 7.6399 12.3507 11.3757 26.3289 5.9302 0.1729 0.0193 8.7348 3.8469 1.7092 3.4399 10.2014 51.1712 11.9626 26.2687 9.8423 1.1470 2.3470 5.4198 14.9847 10.4796 2.0109 1.0266 7.3333 31.9363 3.8341 7.5934 17.5371 2.4568 9.1366 11.9712 19.0224 3.5450 9.1433 6.7068 15.7854 19.4572 3.3093 0.4381 2.5343 8.6348 2.7462 102.2821 113.3659 75.0216 15.2463 35.3536 28.5742 17.5946 32.1341 20.9415 61.8697 26.1459 58.1094 20.3076 17.1673 21.4353 1.5280 0.6010 5.0233 18.4947 17.2223 34.0420 28.6233 29.4666 16.9302 4.6811
temp: 298.150 k
press: 1.00000 atm
elementType: 8 7 6 6 6 6 6 6 6 6 6 6 6 6 6 6 6 6 6 6 6 1 1 1 1 1 1 1 1 1 1 1 1 1 1 1 1 1 1 1 1 1 1 1 1 1
symmnumber: 1
zpe: 1027808.4 jmol-1
zpe.correction: 0.391472 hartree
zpe.thermalcorrener: 0.412082 hartree
zpe.thermalcorrenthalpy: 0.413026 hartree
zpe.thermalcorrgfe: 0.342096 hartree
zpe.sumelectzpe: -867.392933 hartree
zpe.sumelectthermal: -867.372322 hartree
zpe.sumelectthermalent: -867.371378 hartree
zpe.sumelectthermalfe: -867.442308 hartree
dipole: -1.0591 1.3832 -0.5850
dipole: 1.8377
quadrupole: -119.3347 -126.2734 -119.4225
quadrupole: 3.8924 -0.4143 4.3669
quadrupole: 2.3422 -4.5965 2.2544 3.8924 -0.4143 4.3669
hfenergy: -867.7844043 hartree
pointgroup: C01 [X(C19H25N1O1)]
dipole: -0.4242051 -0.5275138 0.2540071 debye
polarizability: 228.6503506|-14.562492|215.1152915|-7.4825121|9.2285841|184.7708134 unknown
InChI: InChI=1S/C19H25NO/c1-4-20(3)15-16(2)19(21,17-11-7-5-8-12-17)18-13-9-6-10-14-18/h5-14,16,21H,4,15H2,1-3H3
charge 0 multiplicity 1
46 atoms
O  -0.20965 0.28211 -2.102712
N  3.363109 0.713183 0.277719
C  0.884134 0.965821 -0.082264
C  -0.39144 0.235253 -0.632608
C  2.187746 0.226352 -0.495756
C  -0.449344 -1.242646 -0.154343
C  -1.71896 0.930343 -0.228477
C  0.970688 2.439185 -0.541304
C  4.627004 0.634731 -0.499649
C  -0.850157 -1.559672 1.169325
C  -1.841235 1.706893 0.951807
C  -0.09031 -2.302662 -1.024645
C  -2.884736 0.731655 -1.012596
C  3.463382 0.055191 1.59783
C  5.800942 1.373569 0.170079
C  -0.88681 -2.899872 1.612381
C  -3.07755 2.279604 1.325259
C  -0.140091 -3.64609 -0.587266
C  -4.122398 1.30363 -0.647606
C  -0.53622 -3.951597 0.734137
C  -4.225487 2.084553 0.526121
H  0.818715 0.928153 1.024354
H  2.06224 -0.87515 -0.384026
H  2.362141 0.422542 -1.568792
H  1.944096 2.846308 -0.215787
H  0.906862 2.492449 -1.642046
H  0.166453 3.068362 -0.12425
H  -1.007201 -0.102884 -2.545547
H  4.92623 -0.429829 -0.694042
H  4.432376 1.097131 -1.485658
H  -1.154853 -0.759882 1.853143
H  -0.967526 1.879103 1.588382
H  0.245553 -2.067266 -2.04004
H  -2.85226 0.111847 -1.91838
H  2.493651 0.115574 2.1217
H  4.212816 0.562821 2.228446
H  3.741763 -1.027454 1.522437
H  5.513809 2.415267 0.400007
H  6.121059 0.886347 1.108208
H  6.673652 1.391868 -0.508467
H  -1.200036 -3.12384 2.63859
H  -3.140909 2.880734 2.239438
H  0.139123 -4.451706 -1.276227
H  -5.005296 1.134582 -1.27439
H  -0.573141 -4.992413 1.074905
H  -5.184431 2.5302 0.812608
