program: Gaussian 09
title: 000203394
version: EM64L-G09RevD.01
frameworkgroup: C1[X(C16H15NO3S)]
method: RPBEPBE
basis: SDD
operation: Freq
keyword: #p
keyword: freq=noraman
keyword: PBEPBE/SDD
title: #p freq=noraman PBEPBE/SDD
converged: NO YES NO NO
title: Mulliken charges:
elementType: S O O O N C C C C C C C C C C C C C C C C H H H H H H H H H H H H H H H
charge: 0.907847 -0.558258 -0.539312 -0.246128 -0.323106 -0.210393 -0.503143 -0.646188 0.337827 0.464535 0.217538 -0.342544 -0.381991 -0.373041 -0.384283 -0.256293 -0.238807 -0.241187 -0.258718 -0.234329 -0.232338 0.248071 0.305414 0.311176 0.316595 0.334324 0.303939 0.261957 0.247124 0.300209 0.240214 0.232258 0.234237 0.234810 0.236590 0.235397
chargesum: 0.00000
title: Mulliken charges with hydrogens summed into heavy atoms:
elementType: S O O O N C C C C C C C C C C C C C C C C
charge: 0.907847 -0.558258 -0.539312 -0.246128 0.011218 -0.210393 0.050342 -0.018417 0.337827 0.464535 0.217538 -0.038605 -0.120035 -0.125918 -0.084074 -0.016079 -0.006549 -0.006951 -0.023908 0.002261 0.003059
polarizability: 2.60332499e+02 -6.17342679e+00 2.31337480e+02 3.12437914e+00 -2.56121407e-01 1.64724350e+02
1716.lowfreq: -9.4784 -0.0013 0.0013 0.0021 6.8106 7.4712 39.2178 53.5695 56.1306
frequency: 39.0679 53.5428 56.0977 64.4188 82.6124 107.2791 118.7005 141.5244 184.3492 187.3135 200.7769 224.0608 242.3292 257.9044 268.7652 292.5017 300.8650 331.3708 381.5846 400.2551 406.2233 415.6851 434.0242 477.9618 495.3058 544.7417 572.5289 585.2797 615.1693 616.3719 651.1614 687.7058 697.7799 701.3542 705.4444 727.6365 766.7310 776.9151 783.6206 801.4068 848.4940 861.1125 864.2348 905.8897 916.4969 933.7281 938.7812 968.8856 979.5217 985.5540 989.2441 992.3692 1001.9014 1004.3283 1011.8715 1034.2677 1039.2064 1091.9856 1095.6872 1116.1312 1135.6001 1177.4108 1178.2565 1204.3621 1206.0006 1209.6005 1222.1700 1246.0728 1273.1074 1322.8941 1338.1786 1338.7974 1376.1569 1379.0745 1387.5319 1401.4984 1427.3034 1434.9690 1440.0445 1464.5538 1482.0302 1485.5930 1579.8020 1582.6346 1605.7368 1607.9063 1614.3254 2987.9011 3036.6423 3057.7471 3127.0613 3132.7912 3133.6908 3143.0317 3145.9802 3148.2894 3155.8719 3159.1409 3164.7303 3170.2291 3173.8469 3502.4690
redmass: 4.8280 6.2104 5.1455 6.4704 4.5731 4.6327 4.6139 9.1060 6.5340 7.5447 4.3475 6.2221 4.8028 4.9391 4.4902 3.0401 4.8197 6.9587 10.1682 2.8333 3.2442 7.0005 4.2493 3.1912 2.3663 3.6935 5.6112 4.2498 6.3856 6.3291 4.4212 1.5865 3.6985 1.8762 2.0425 3.9075 1.8871 2.2149 7.4336 3.5317 1.2949 1.2472 2.5107 2.8399 6.2187 1.7748 1.4344 2.2810 1.4402 2.3736 5.4703 1.9565 1.3684 1.5171 3.0492 2.2089 2.1025 1.7751 1.6718 2.5391 1.1936 1.0560 1.0559 1.1944 2.5355 1.1830 1.2886 1.7056 2.5159 1.5720 1.6816 1.3935 4.6819 7.0382 1.1634 1.4133 1.7369 2.2583 2.2379 1.2365 2.0322 2.1509 5.5309 5.7591 5.7135 5.7918 4.6989 1.0586 1.1024 1.0567 1.0877 1.0854 1.0883 1.0888 1.0926 1.1075 1.0932 1.0953 1.0957 1.1003 1.1005 1.0754
irintensity: 0.2003 0.3945 0.5687 3.6751 2.0043 3.4757 2.8216 8.4984 8.2024 2.1123 1.3974 4.5160 1.7140 2.8135 0.2350 3.5046 1.5838 23.0280 10.9257 0.5491 7.1484 34.3186 6.4217 5.2408 10.1891 8.3609 8.1769 47.8741 0.3100 1.0374 11.4705 91.3954 23.0622 35.7650 28.5254 25.3265 34.6087 23.2815 41.1787 16.3193 5.6750 1.1302 23.5803 7.8903 66.6667 7.1890 2.6462 14.2155 0.4311 1.2877 1.3115 0.6510 0.2865 0.5767 1.1393 6.7769 3.2057 0.8871 4.6987 26.6985 9.5514 0.1903 0.0469 2.8431 1.3892 8.3102 13.1861 18.3084 32.7442 5.0788 27.3539 3.9660 3.0743 0.1587 32.9683 9.9739 10.8668 17.1463 13.9995 42.4685 10.8519 16.9378 0.3541 1.2690 0.9717 1.6089 291.0814 17.4684 3.5365 1.6222 1.2263 0.0518 3.2311 6.7046 7.0888 1.6953 23.1041 21.3320 12.6906 25.9130 14.6787 31.3357
temp: 298.150 k
press: 1.00000 atm
elementType: 16 8 8 8 7 6 6 6 6 6 6 6 6 6 6 6 6 6 6 6 6 1 1 1 1 1 1 1 1 1 1 1 1 1 1 1
symmnumber: 1
zpe: 719787.6 jmol-1
zpe.correction: 0.274153 hartree
zpe.thermalcorrener: 0.292997 hartree
zpe.thermalcorrenthalpy: 0.293941 hartree
zpe.thermalcorrgfe: 0.227087 hartree
zpe.sumelectzpe: -1295.541080 hartree
zpe.sumelectthermal: -1295.522235 hartree
zpe.sumelectthermalent: -1295.521291 hartree
zpe.sumelectthermalfe: -1295.588146 hartree
dipole: 2.0864 5.1864 -4.2869
dipole: 7.0449
quadrupole: -130.3661 -130.8604 -131.7077
quadrupole: -9.4207 -3.9851 6.2761
quadrupole: 0.6120 0.1177 -0.7296 -9.4207 -3.9851 6.2761
hfenergy: -1295.8152326 hartree
pointgroup: C01 [X(C16H15N1O3S1)]
dipole: 0.8665133 1.7474472 -1.9691913 debye
polarizability: 259.9905387|-6.5990696|230.218494|3.3355536|-9.9371312|166.1852972 unknown
InChI: InChI=1S/C16H15NO3S/c18-16(12-21(19)20)17-11-15(13-7-3-1-4-8-13)14-9-5-2-6-10-14/h1-10,17H,11-12H2
charge 0 multiplicity 1
36 atoms
S  -0.477355 -1.283224 1.474443
O  -0.014461 -2.857378 1.3267
O  -0.199758 -0.487845 2.877126
O  -3.906449 -2.050427 -0.564377
N  -1.801049 -1.525784 -1.35793
C  0.17167 -0.239059 -0.306567
C  -0.341639 -1.269581 -1.330737
C  -2.366737 -1.247819 1.089834
C  -0.524065 1.093803 -0.226832
C  1.686451 -0.216345 -0.262748
C  -2.723313 -1.657766 -0.334722
C  -0.269249 1.948594 0.885537
C  2.395064 0.986759 -0.537003
C  -1.40805 1.546297 -1.244521
C  2.432481 -1.407125 -0.021039
C  -0.887228 3.212117 0.975357
C  3.805472 0.999333 -0.573889
C  -2.011852 2.819377 -1.158709
C  3.841813 -1.383333 -0.043777
C  -1.758901 3.655363 -0.0471
C  4.536216 -0.184266 -0.325961
H  -0.055776 -0.904771 -2.33662
H  0.202066 -2.218532 -1.160933
H  -2.681604 -0.212521 1.296351
H  -2.822434 -1.945615 1.808192
H  -2.179796 -1.828346 -2.261722
H  0.396599 1.609703 1.68533
H  1.84316 1.910904 -0.732185
H  -1.623128 0.91342 -2.109978
H  1.913741 -2.338209 0.233893
H  -0.689604 3.849024 1.844081
H  4.331915 1.934269 -0.794865
H  -2.682804 3.15519 -1.956766
H  4.398493 -2.303086 0.166052
H  -2.236029 4.639047 0.021811
H  5.631438 -0.171769 -0.347625
