program: Gaussian 09
title: 000203441
version: EM64L-G09RevD.01
frameworkgroup: C1[X(C22H32O3)]
method: RPBEPBE
basis: SDD
operation: Freq
keyword: #pfreq=noraman
keyword: PBEPBE/SDD
title: #p freq=noraman PBEPBE/SDD
converged: YES YES NO NO
title: Mulliken charges:
elementType: O O O C C C C C C C C C C C C C C C C C C C C C C H H H H H H H H H H H H H H H H H H H H H H H H H H H H H H H H
charge: -0.463683 -0.217561 -0.233924 -0.117361 0.343193 -0.167167 -0.092960 0.222775 0.163812 -0.517249 -0.528756 -0.561000 -0.510791 -0.549507 -0.189992 0.444462 -0.826920 -0.494805 -0.812376 0.142364 -0.560421 -0.557032 -0.767458 0.163253 -0.770028 0.174291 0.234649 0.202679 0.222523 0.205688 0.222664 0.226325 0.221546 0.237043 0.221898 0.213743 0.273601 0.233989 0.225458 0.252759 0.231420 0.223593 0.218307 0.215583 0.219435 0.229663 0.234712 0.245551 0.231628 0.336262 0.272715 0.220993 0.220718 0.230132 0.266261 0.251752 0.241553
chargesum: 0.00000
title: Mulliken charges with hydrogens summed into heavy atoms:
elementType: O O O C C C C C C C C C C C C C C C C C C C C C C
charge: -0.127421 -0.217561 -0.233924 0.056930 0.343193 0.067481 0.109719 0.222775 0.163812 -0.089038 -0.079766 -0.102411 -0.075150 -0.041917 0.035466 0.444462 -0.119148 -0.060914 -0.128567 0.142364 -0.083243 -0.284317 -0.095616 0.163253 -0.010462
polarizability: 3.03975339e+02 -4.45061479e+00 2.23945619e+02 -1.68226923e+01 3.14428077e+00 1.87484737e+02
1716.lowfreq: -9.4815 -0.0004 -0.0003 0.0004 5.2661 13.7767 32.5182 40.2170 60.8364
frequency: 32.4309 39.9252 60.8135 69.5952 83.9874 114.4978 131.5803 145.9490 147.5781 157.0990 172.3820 188.2279 203.5797 218.5709 228.9188 233.9054 239.8816 255.6542 264.6176 274.2386 277.5985 287.2001 296.6868 318.9322 338.6486 345.9588 369.6396 372.1027 374.3108 397.3145 407.0982 420.7427 440.3702 458.2459 482.1508 504.6180 505.9934 525.3752 538.1568 547.8900 577.4470 587.7136 610.6438 631.1152 647.7884 675.5699 687.1065 739.5677 781.3181 791.5352 810.9584 815.8041 845.0507 855.3654 881.7128 888.8486 904.3435 911.2002 921.3456 925.6067 940.9747 948.2750 953.0524 964.7378 982.2701 988.8159 994.8380 1012.4410 1013.9773 1030.7683 1033.2338 1044.2980 1060.7700 1062.5126 1071.0339 1089.0628 1106.5881 1114.3838 1119.6354 1126.3903 1128.7767 1141.0200 1146.9470 1163.4230 1171.3421 1183.3146 1187.5553 1196.0576 1201.2263 1218.7709 1225.9770 1236.9107 1250.2766 1265.8675 1267.4443 1275.6132 1281.8203 1290.1499 1293.5010 1296.0781 1300.7852 1309.6915 1321.4238 1323.4175 1328.3484 1334.0011 1338.9566 1354.3614 1356.8729 1358.7492 1366.9458 1370.4580 1390.5786 1394.6044 1405.5964 1435.9470 1437.2130 1443.5001 1459.3561 1463.1194 1467.8892 1468.7292 1472.3313 1477.6674 1482.7498 1483.1260 1486.6483 1488.3612 1491.9657 1493.7198 1583.6857 1619.9794 1621.7379 2870.3727 2915.1116 2925.7768 2955.6500 2970.0883 2972.7023 2975.6239 2980.0184 2982.6124 2987.3257 2993.8502 2995.0665 2997.3835 2999.6337 3017.6109 3029.7590 3031.2835 3045.2358 3053.8692 3055.9706 3063.5809 3073.8576 3079.6411 3079.7141 3080.0121 3081.4593 3083.0427 3083.0975 3100.0929 3126.6646 3148.6870 3561.5172
redmass: 6.1749 3.9730 4.2224 3.7182 3.5685 3.1057 1.0753 2.7432 3.2006 3.0559 2.4170 3.1894 2.6500 2.2188 1.3460 1.5682 1.2322 2.1436 2.3413 2.0795 2.7253 2.3648 1.4167 2.7353 3.0296 3.0761 3.7123 2.9702 3.1336 2.9162 3.5691 3.1093 3.3386 3.4890 2.9851 3.5299 2.6249 2.8007 3.4152 3.2515 3.5883 3.1328 3.0401 3.4222 3.6172 2.9868 2.8322 2.9844 2.0808 1.9926 2.2081 2.2444 2.6754 2.1371 1.7048 1.8134 2.0059 2.0010 1.8661 1.6667 1.9713 1.9645 1.9499 2.2350 2.1722 2.0170 2.3543 1.6906 2.0479 1.9902 1.8950 1.7511 2.4236 2.6685 2.1766 2.8089 1.8370 1.8384 2.1760 2.3318 2.0049 1.8073 1.8810 1.9258 2.2747 1.7661 1.8353 2.3316 1.9914 1.2685 1.8957 1.5425 1.3741 1.5822 1.3538 1.5678 1.6521 1.4339 1.4437 1.4544 1.5366 1.3875 1.3989 1.4198 1.3671 1.7861 1.7246 1.8313 1.3976 1.5791 1.2523 1.3750 1.2010 1.2117 1.1881 1.0614 1.0797 1.0779 1.0692 1.0880 1.0793 1.0788 1.0834 1.0756 1.0532 1.0501 1.0510 1.0543 1.0755 1.0629 10.1973 7.4340 8.1357 1.0795 1.0808 1.0792 1.0657 1.0780 1.0601 1.0649 1.0362 1.0625 1.0370 1.0526 1.0355 1.0573 1.0493 1.0631 1.0992 1.0988 1.0983 1.1004 1.1009 1.0961 1.0993 1.0970 1.0969 1.0990 1.0994 1.0988 1.1017 1.0983 1.1029 1.0901 1.0657
irintensity: 3.6213 2.2948 1.2276 2.7940 1.4670 0.8843 0.1590 0.2787 1.5638 0.9384 0.8675 0.5360 0.8993 0.7840 2.8433 0.2794 130.7651 16.8231 1.3625 1.5688 13.1112 2.7833 0.4480 1.6047 1.7178 4.1007 1.8238 0.8354 0.7620 1.8196 5.4286 0.1606 2.6210 3.8614 1.0613 4.0980 0.4067 0.3641 3.6167 5.7107 9.5350 4.9786 1.8793 1.4621 0.8001 4.5682 9.2210 2.1013 4.3539 1.1697 6.0051 0.1357 6.3622 1.8891 23.8842 3.3112 7.7169 8.7749 9.5022 2.5210 12.2288 13.2225 45.4159 4.3975 2.6162 2.6408 1.0040 9.1279 7.9711 1.1372 3.2743 0.0358 8.2611 3.7317 1.6151 14.4790 19.6953 14.6427 1.9183 25.1281 4.3301 3.9881 1.5824 95.8708 7.8426 7.7764 17.3203 2.1559 22.8467 9.2090 5.5364 24.5190 5.2486 11.8136 6.2450 24.8523 25.3444 10.5341 3.1617 4.3240 9.2173 3.6561 2.1527 4.3135 3.0455 13.4587 15.7593 5.4851 0.5716 7.3163 68.2709 4.6847 17.6801 15.6047 29.2811 17.9527 19.6549 20.7544 4.7382 2.8282 10.4296 6.2888 7.8786 10.3298 11.0974 6.7336 18.4253 3.3221 9.7917 9.1651 141.9764 260.3591 53.0225 29.5340 14.7416 9.7976 19.7213 24.9984 38.1535 24.6074 28.5241 25.7416 17.6080 7.1428 2.1429 32.4187 36.7644 20.3250 36.8683 20.5545 46.1893 34.5127 24.4199 21.9492 31.6278 7.8325 10.2115 64.9423 16.2811 28.8894 28.9166 19.7916 17.4449 6.2090 2.4959
temp: 298.150 k
press: 1.00000 atm
elementType: 8 8 8 6 6 6 6 6 6 6 6 6 6 6 6 6 6 6 6 6 6 6 6 6 6 1 1 1 1 1 1 1 1 1 1 1 1 1 1 1 1 1 1 1 1 1 1 1 1 1 1 1 1 1 1 1 1
symmnumber: 1
zpe: 1294906.5 jmol-1
zpe.correction: 0.493204 hartree
zpe.thermalcorrener: 0.517896 hartree
zpe.thermalcorrenthalpy: 0.518840 hartree
zpe.thermalcorrgfe: 0.441470 hartree
zpe.sumelectzpe: -1081.275642 hartree
zpe.sumelectthermal: -1081.250950 hartree
zpe.sumelectthermalent: -1081.250006 hartree
zpe.sumelectthermalfe: -1081.327376 hartree
dipole: -1.5675 0.8459 0.9335
dipole: 2.0110
quadrupole: -214.2004 -142.6148 -153.8601
quadrupole: 6.2817 20.0090 -3.3183
quadrupole: -43.9753 27.6103 16.3650 6.2817 20.0090 -3.3183
hfenergy: -1081.7688459 hartree
pointgroup: C01 [X(C22H32O3)]
dipole: 0.6208404 -0.3229752 0.3690752 debye
polarizability: 304.0100765|-3.2021117|223.8226386|17.1547204|-2.9299866|187.5729802 unknown
InChI: InChI=1S/C22H32O3/c1-13-11-16-17(20(3)8-5-15(24)12-19(13)20)6-9-21(4)18(16)7-10-22(21,25)14(2)23/h12-13,16-18,25H,5-11H2,1-4H3
charge 0 multiplicity 1
57 atoms
O  3.596112 0.271761 -1.973439
O  5.54866 0.158088 0.982746
O  -6.085268 0.752317 -1.250481
C  1.408994 -0.897634 -0.241005
C  2.327855 0.278495 0.229089
C  -0.010143 -0.854239 0.366128
C  -0.674692 0.506153 -0.012211
C  -2.164174 0.645677 0.509237
C  3.66907 -0.111432 -0.543787
C  1.668685 1.614467 -0.183762
C  0.223407 1.715871 0.375959
C  2.287176 -2.158126 -0.049124
C  -0.874965 -2.028676 -0.134524
C  3.737243 -1.665333 -0.377328
C  -2.327104 -1.964732 0.41606
C  -2.962754 -0.611516 0.094954
C  2.584743 0.251493 1.760149
C  -2.786923 1.918873 -0.148517
C  -2.222572 0.77801 2.065228
C  4.919528 0.618195 -0.00849
C  -4.324844 1.983066 -0.069573
C  -4.202341 -0.526022 -0.489264
C  -3.13926 -3.19706 -0.031364
C  -4.9546 0.731687 -0.672873
C  5.342293 1.898647 -0.701892
H  1.254866 -0.762812 -1.341003
H  0.070264 -0.934588 1.470798
H  -0.749435 0.502142 -1.125445
H  1.651031 1.689209 -1.288679
H  2.258049 2.476545 0.186821
H  0.26813 1.810772 1.47741
H  -0.226503 2.652309 -0.001365
H  1.974107 -2.991464 -0.702255
H  2.219432 -2.519284 0.994245
H  -0.421922 -2.991604 0.170239
H  -0.907221 -2.022013 -1.244933
H  4.446297 -1.913447 0.430219
H  4.132651 -2.108024 -1.309155
H  -2.239946 -2.009878 1.525736
H  3.15782 -0.634805 2.078045
H  3.168701 1.136455 2.069914
H  1.638397 0.266284 2.326054
H  -2.489789 1.941746 -1.216998
H  -2.360535 2.823228 0.323241
H  -1.695507 -0.048411 2.573379
H  -1.761604 1.725631 2.395392
H  -3.268826 0.77128 2.419352
H  -4.722415 2.871199 -0.591547
H  -4.659257 2.057974 0.985493
H  2.861269 -0.238908 -2.397605
H  -4.737293 -1.426798 -0.808554
H  -3.265588 -3.220378 -1.129788
H  -2.609808 -4.120695 0.26548
H  -4.142416 -3.223329 0.430158
H  5.697179 1.661338 -1.721428
H  4.482478 2.57827 -0.836735
H  6.143771 2.387328 -0.126401
