program: Gaussian 09
title: 000203374
version: EM64L-G09RevD.01
frameworkgroup: C1[X(C14H29NO)]
method: RPBEPBE
basis: SDD
operation: Freq
keyword: #p
keyword: freq=noraman
keyword: PBEPBE/SDD
title: #p freq=noraman PBEPBE/SDD
converged: NO YES NO NO
title: Mulliken charges:
elementType: O N C C C C C C C C C C C C C C H H H H H H H H H H H H H H H H H H H H H H H H H H H H H
charge: -0.437738 -0.117106 0.435292 0.376798 -0.238420 -0.319324 -0.512931 -0.480574 -0.813453 -0.791412 -0.383073 -0.733450 -0.634446 -0.630171 -0.358438 -0.700051 0.213406 0.232931 0.190529 0.222130 0.225263 0.197945 0.213782 0.225349 0.246542 0.211302 0.224359 0.217242 0.224622 0.202176 0.344263 0.210412 0.214535 0.219417 0.241252 0.184953 0.217574 0.222017 0.185535 0.229512 0.189281 0.194026 0.209927 0.213219 0.215001
chargesum: 0.00000
title: Mulliken charges with hydrogens summed into heavy atoms:
elementType: O N C C C C C C C C C C C C C C
charge: -0.093476 -0.117106 0.435292 0.376798 -0.025013 -0.086393 -0.100273 -0.057367 -0.127780 -0.138509 0.043725 -0.089087 0.009333 0.006892 0.024869 -0.061904
polarizability: 1.76467860e+02 1.37666977e-01 1.52826147e+02 1.36621097e+00 -1.56219579e+00 1.51443483e+02
1716.lowfreq: -13.6050 -8.1052 -0.0006 -0.0003 -0.0002 12.9333 43.7956 66.9394 71.1175
frequency: 43.7713 66.8398 71.0983 72.3224 100.3565 108.7847 137.8980 150.3702 159.7865 182.8031 185.0502 204.8159 225.1367 226.9946 234.0716 244.8105 252.7395 259.7866 275.9460 284.5276 290.9875 301.9694 326.2854 340.1939 368.4579 380.1836 400.1636 422.4103 462.2703 516.9093 557.1550 591.3093 630.5976 731.0612 749.8078 760.8553 776.9458 786.1406 824.7442 879.0696 885.2971 894.1113 931.5145 943.6189 956.4491 972.9533 996.3595 1011.6703 1025.8148 1026.5820 1040.6756 1065.2944 1071.0676 1082.1959 1087.7304 1090.1402 1097.4937 1131.5480 1139.1265 1166.9640 1167.6636 1178.6757 1193.3339 1214.5254 1223.2962 1246.7342 1252.2268 1263.3728 1268.4066 1278.1349 1291.1931 1296.5777 1304.6498 1324.4170 1336.5751 1348.9594 1352.6893 1376.1823 1384.5291 1388.5068 1391.3346 1397.0582 1415.0257 1439.4649 1457.1964 1459.3906 1464.5672 1465.5796 1468.5489 1469.7309 1473.7034 1474.9400 1476.1352 1479.9555 1481.1055 1484.0620 1486.4770 1487.1834 1493.8779 1499.6918 2844.0459 2846.6014 2862.2690 2956.2508 2957.3582 2962.6983 2971.8386 2974.7035 2975.1422 2977.0960 2984.3613 3000.1399 3011.8749 3021.1039 3025.7117 3031.0652 3043.7533 3048.8376 3055.9454 3059.6027 3061.4091 3065.0463 3068.9523 3070.9050 3072.7320 3090.1836 3095.1168 3106.3587 3563.8835
redmass: 3.3240 3.1918 2.3899 1.7842 2.5713 2.6272 2.4651 1.8898 2.1123 1.5204 1.9177 1.7890 1.2931 1.3469 1.0697 1.6739 1.5262 1.6216 2.7235 2.2456 2.4785 2.5486 2.9309 2.6679 2.6155 1.2084 2.5444 2.3226 2.7796 2.9795 3.0218 2.7002 3.0300 1.1039 1.5478 2.8221 1.3659 3.5491 2.2950 3.1199 1.8957 1.8456 1.5964 1.4600 1.5682 1.7149 1.4184 2.9661 2.4781 1.7681 2.0650 1.9137 2.2884 2.4501 1.8860 1.2833 2.0352 1.8097 1.9125 2.0293 2.4377 2.1947 1.8642 1.7486 1.6107 1.9116 2.7162 1.6404 1.4735 1.6468 1.1013 1.3710 1.4595 1.3890 1.4625 1.3121 1.5183 1.2233 1.2152 1.2143 1.2044 1.2062 1.1396 1.1785 1.0652 1.0662 1.0566 1.0588 1.0574 1.0571 1.0568 1.0532 1.0436 1.0487 1.0618 1.0525 1.0535 1.0585 1.0873 1.0537 1.0584 1.0738 1.0635 1.0618 1.0592 1.0352 1.0378 1.0548 1.0370 1.0415 1.0599 1.0988 1.0973 1.0975 1.0732 1.0740 1.0882 1.1020 1.0978 1.0975 1.0986 1.0982 1.1005 1.0995 1.0995 1.0981 1.0983 1.0970 1.0650
irintensity: 0.1712 0.4926 0.0992 0.0712 0.6279 0.1832 0.0750 0.7426 1.0764 0.4764 1.1554 0.7088 0.0457 0.4074 0.3944 0.3829 0.5223 1.0137 0.3227 3.6508 3.9463 0.7244 1.8201 3.8316 6.8432 117.3390 23.9720 25.3237 9.6561 5.4942 0.5036 5.8704 1.7793 4.8098 2.7175 3.0604 1.0935 9.5641 3.4317 6.7050 10.7367 2.6461 14.6132 3.7759 12.3197 6.6955 23.9574 67.8748 50.1557 33.9535 4.6769 3.5016 2.4847 11.8856 6.3931 4.3949 5.0871 15.9096 1.1055 5.5780 2.0298 2.4923 8.7186 9.3519 4.9606 0.9469 4.5403 10.7098 1.4770 2.4769 0.4475 1.3040 2.8426 2.9606 1.7328 23.7710 0.5587 20.8954 9.6495 13.1477 17.9986 10.8576 3.0298 9.7303 2.1416 4.1076 12.5601 8.3504 3.0637 1.3271 0.4485 20.0969 11.6147 9.3593 4.0486 7.4955 30.2866 5.3872 11.0438 17.9355 56.7295 35.7018 220.0073 41.8847 22.3998 33.3667 30.5800 18.8343 35.9061 12.5223 71.8016 9.0341 16.4822 1.3378 32.5909 52.3079 19.9180 30.4127 29.1027 45.2740 42.1328 36.8130 95.9267 51.4994 61.0132 20.3680 34.5501 25.5844 4.7500
temp: 298.150 k
press: 1.00000 atm
elementType: 8 7 6 6 6 6 6 6 6 6 6 6 6 6 6 6 1 1 1 1 1 1 1 1 1 1 1 1 1 1 1 1 1 1 1 1 1 1 1 1 1 1 1 1 1
symmnumber: 1
zpe: 1064453.3 jmol-1
zpe.correction: 0.405429 hartree
zpe.thermalcorrener: 0.425960 hartree
zpe.thermalcorrenthalpy: 0.426904 hartree
zpe.thermalcorrgfe: 0.358407 hartree
zpe.sumelectzpe: -679.471121 hartree
zpe.sumelectthermal: -679.450590 hartree
zpe.sumelectthermalent: -679.449646 hartree
zpe.sumelectthermalfe: -679.518143 hartree
dipole: -1.0055 -1.8508 -0.5225
dipole: 2.1701
quadrupole: -100.9428 -106.5919 -102.9252
quadrupole: -0.7727 -0.5190 -3.4959
quadrupole: 2.5438 -3.1052 0.5615 -0.7727 -0.5190 -3.4959
hfenergy: -679.8765498 hartree
pointgroup: C01 [X(C14H29N1O1)]
dipole: 0.4067707 0.7451227 0.0910519 debye
polarizability: 176.5250791|0.1611245|151.5349792|-0.6314194|1.6303853|152.6774318 unknown
InChI: InChI=1S/C14H29NO/c1-7-9-10-14(8-2)11(15(5)6)13(3,4)12(14)16/h11-12,16H,7-10H2,1-6H3
charge 0 multiplicity 1
45 atoms
O  -0.752709 -2.353601 -0.596384
N  1.616255 1.585825 -0.448535
C  -0.106618 -0.109507 0.620082
C  1.528339 -1.058781 -0.636137
C  1.381332 0.279724 0.203412
C  0.239733 -1.574582 0.130641
C  -1.195506 0.56356 -0.266543
C  -0.488427 0.008311 2.123065
C  1.316079 -0.942239 -2.162901
C  2.79374 -1.884055 -0.332311
C  -2.661545 0.171059 0.055559
C  0.596339 -0.366375 3.157824
C  2.98771 1.689786 -1.000973
C  1.374832 2.704849 0.494758
C  -3.653734 0.728573 -0.991722
C  -5.125795 0.406417 -0.655103
H  2.049921 0.182139 1.096591
H  0.514187 -2.237992 0.969071
H  -0.996477 0.357125 -1.337256
H  -1.100087 1.662596 -0.179898
H  -1.369146 -0.6427 2.291821
H  -0.831095 1.04312 2.333713
H  2.282531 -0.845036 -2.689353
H  0.834835 -1.861978 -2.547836
H  0.705577 -0.065164 -2.436548
H  2.926845 -2.030605 0.756677
H  2.728567 -2.883648 -0.802663
H  3.703311 -1.3855 -0.718423
H  -2.761936 -0.930691 0.110936
H  -2.946892 0.560587 1.052507
H  -1.09518 -1.813876 -1.352785
H  1.021118 -1.371026 2.971265
H  1.431605 0.356719 3.165156
H  0.16143 -0.378823 4.174405
H  3.153252 0.917267 -1.767182
H  3.781273 1.579351 -0.217395
H  3.11423 2.678399 -1.478336
H  1.493787 3.666963 -0.035649
H  2.082856 2.697858 1.363486
H  0.35046 2.657222 0.897215
H  -3.404342 0.315949 -1.991564
H  -3.522545 1.827523 -1.071499
H  -5.412812 0.843151 0.32014
H  -5.28732 -0.686263 -0.591996
H  -5.815179 0.807271 -1.420935
