program: Gaussian 09
title: 000203370
version: EM64L-G09RevD.01
frameworkgroup: C1[X(C15H29N)]
method: RPBEPBE
basis: SDD
operation: Freq
keyword: #pfreq=noraman
keyword: PBEPBE/SDD
title: #p freq=noraman PBEPBE/SDD
converged: YES YES NO NO
title: Mulliken charges:
elementType: N C C C C C C C C C C C C C C C H H H H H H H H H H H H H H H H H H H H H H H H H H H H H
charge: -0.174303 0.530035 -0.491672 -0.516422 -0.535234 -0.412685 -0.416620 -0.391249 -0.379038 -0.361937 -0.401984 -0.399393 -0.376024 -0.402033 -0.349865 -0.702501 0.202977 0.207946 0.223381 0.185449 0.212733 0.194553 0.190867 0.207335 0.206392 0.192726 0.200965 0.186850 0.216599 0.175110 0.160953 0.205626 0.200553 0.186882 0.185928 0.202896 0.195054 0.225686 0.187692 0.210598 0.190227 0.190466 0.211577 0.209685 0.213217
chargesum: 0.00000
title: Mulliken charges with hydrogens summed into heavy atoms:
elementType: N C C C C C C C C C C C C C C C
charge: -0.174303 0.530035 -0.080749 -0.107592 -0.127948 -0.014483 -0.017502 -0.003434 0.012671 0.004643 -0.014550 -0.010569 0.044716 -0.003743 0.030829 -0.068022
polarizability: 1.79857505e+02 3.92616177e+00 1.67841455e+02 -5.58904448e-01 -1.29640071e+00 1.44093554e+02
1716.lowfreq: -15.0094 -12.3409 -9.5687 -0.0004 0.0004 0.0006 23.3466 42.2045 44.8637
frequency: 20.8279 41.9414 44.8399 77.4536 100.3500 114.8563 130.9351 183.8969 212.9466 217.4837 224.0836 252.3828 257.2818 294.6903 303.8133 344.6752 361.9365 372.5398 398.5060 439.5963 446.6102 462.7510 470.8938 504.5051 515.6306 605.9145 684.5772 723.7488 761.7005 775.1918 803.7593 806.3727 821.9566 848.3040 850.8010 857.3058 888.6363 904.1518 910.5922 921.8381 928.4217 949.1028 956.4697 962.2329 1003.6015 1032.9912 1033.8122 1043.5059 1054.0571 1069.4245 1074.8064 1079.1268 1090.1953 1104.7521 1118.2908 1127.3684 1139.2225 1145.4781 1148.3341 1170.1840 1191.3228 1209.4471 1232.5373 1249.0379 1254.7747 1259.4461 1263.7163 1274.5514 1277.4701 1281.2325 1290.2213 1303.1507 1315.9150 1327.0611 1331.0680 1331.8396 1337.9101 1339.7734 1340.7593 1348.5191 1350.2082 1351.3861 1355.0190 1374.9445 1387.4569 1447.3547 1456.3282 1457.3540 1459.3495 1461.4332 1463.1414 1466.4113 1469.0768 1472.7657 1475.0604 1477.1103 1479.4045 1482.9053 1487.3481 1499.5434 2824.1790 2837.5853 2957.0484 2961.0082 2961.4558 2963.7477 2970.1516 2971.5042 2974.0196 2976.7529 2978.3330 2980.7548 2981.9868 2986.6955 3000.1854 3016.9691 3021.8080 3024.9746 3027.8982 3028.3016 3038.0916 3038.7485 3046.7387 3048.6338 3052.9963 3065.8869 3068.1608 3068.7213 3074.3184
redmass: 2.8631 2.0874 2.0450 3.1072 2.8398 2.5709 2.7501 2.6492 1.9295 1.7084 1.3685 2.3112 3.9084 2.0436 2.6449 2.1610 1.8477 2.2412 2.3068 2.9960 2.9169 2.3187 2.2666 1.6462 3.0074 2.1848 2.9074 1.1016 1.6471 1.4506 1.6292 1.7758 2.0825 1.8568 1.7690 1.8390 1.8734 1.8614 2.0264 1.8649 1.4138 2.1495 1.3454 2.0616 2.1913 2.2462 2.3394 1.8831 1.9276 1.6427 1.8568 1.9835 1.3790 1.9868 2.5074 2.2300 1.6351 1.3009 1.9814 2.4163 1.7494 1.5278 1.7914 1.3096 1.2926 1.2677 1.2665 1.3585 1.2458 1.1087 1.3941 1.4310 1.3929 1.3225 1.3707 1.4245 1.4137 1.4319 1.4497 1.4597 1.4824 1.5289 1.4107 1.3249 1.2164 1.0922 1.0864 1.0816 1.0888 1.0839 1.0854 1.0869 1.0709 1.0844 1.0428 1.0748 1.0812 1.0906 1.0766 1.0836 1.0716 1.0704 1.0588 1.0617 1.0598 1.0617 1.0489 1.0518 1.0634 1.0613 1.0604 1.0619 1.0643 1.0630 1.0968 1.0975 1.0959 1.0954 1.0967 1.1000 1.1028 1.1011 1.1006 1.1024 1.1003 1.0874 1.0991 1.0993 1.0865
irintensity: 0.2778 0.0115 0.0139 0.2206 0.0516 0.0550 0.0496 0.3216 0.3495 0.1570 0.0638 0.2031 0.1610 0.9248 2.5512 0.9556 0.2433 0.8515 3.5916 0.9409 0.6700 0.3525 1.7451 1.5603 0.3257 5.0346 1.5544 9.2679 1.1389 0.9099 0.4276 0.5649 0.8602 6.8510 2.6705 8.3466 9.3230 4.8858 4.8823 4.5324 3.0680 23.6604 1.8785 11.7207 21.0311 2.4205 1.7000 0.5670 1.8544 11.2584 6.0926 16.2586 4.6870 0.5862 2.4219 12.6733 0.7644 5.6880 10.0478 15.7637 4.3206 2.4538 9.6630 5.8717 6.5663 1.0521 9.7071 0.5740 4.4014 0.3987 1.4511 5.6063 3.7136 10.2436 1.2411 2.2409 3.0964 0.4655 6.7155 1.1274 5.1006 1.3362 3.2620 0.6490 12.1068 5.5880 13.8019 0.2495 1.6782 5.6473 5.5217 9.1701 3.9766 18.0866 12.9612 7.1827 5.3053 2.6255 5.4349 19.3095 53.0308 129.7065 27.8473 33.5876 26.2285 41.0338 16.4218 25.6238 24.7942 52.2101 49.3352 43.1343 60.3133 12.7254 12.3129 48.4227 87.8048 9.6356 69.2450 12.3608 12.6024 90.7052 23.4650 87.4747 93.1164 56.0586 104.9252 53.3630 29.5728
temp: 298.150 k
press: 1.00000 atm
elementType: 7 6 6 6 6 6 6 6 6 6 6 6 6 6 6 6 1 1 1 1 1 1 1 1 1 1 1 1 1 1 1 1 1 1 1 1 1 1 1 1 1 1 1 1 1
symmnumber: 1
zpe: 1087242.0 jmol-1
zpe.correction: 0.414109 hartree
zpe.thermalcorrener: 0.431410 hartree
zpe.thermalcorrenthalpy: 0.432354 hartree
zpe.thermalcorrgfe: 0.368614 hartree
zpe.sumelectzpe: -642.413376 hartree
zpe.sumelectthermal: -642.396075 hartree
zpe.sumelectthermalent: -642.395130 hartree
zpe.sumelectthermalfe: -642.458870 hartree
dipole: -0.1409 -0.6549 -0.3527
dipole: 0.7570
quadrupole: -101.4411 -103.0182 -102.3259
quadrupole: -0.1483 -0.6770 -1.3480
quadrupole: 0.8206 -0.7565 -0.0641 -0.1483 -0.6770 -1.3480
hfenergy: -642.8274842 hartree
pointgroup: C01 [X(C15H29N1)]
dipole: -0.0181472 0.2632152 -0.138202 debye
polarizability: 177.0176785|6.4693661|170.6663241|-0.7066876|1.2296341|144.1085107 unknown
InChI: InChI=1S/C15H29N/c1-2-3-10-15(11-6-4-7-12-15)16-13-8-5-9-14-16/h2-14H2,1H3
charge 0 multiplicity 1
45 atoms
N  -1.048094 0.037455 0.115874
C  0.32011 0.660167 -0.107365
C  0.26627 1.83696 -1.143742
C  0.85845 1.232118 1.242641
C  1.2931 -0.450494 -0.62879
C  1.606622 2.602173 -1.291313
C  2.219531 1.957846 1.105695
C  2.128335 3.109114 0.074244
C  -1.649085 -0.620883 -1.075409
C  -2.077264 0.874266 0.786563
C  -2.816623 -1.547178 -0.668198
C  -3.265574 0.009323 1.265726
C  1.360138 -1.742959 0.214919
C  -3.905913 -0.757042 0.088577
C  2.27996 -2.811606 -0.419335
C  2.380005 -4.097776 0.429504
H  -0.513518 2.55514 -0.815171
H  -0.050909 1.44801 -2.13165
H  0.911212 0.420761 1.992102
H  0.145323 1.982198 1.634544
H  2.309945 -0.021932 -0.694519
H  1.02794 -0.711478 -1.673686
H  1.469122 3.456496 -1.983634
H  2.368102 1.944999 -1.755854
H  3.016875 1.249444 0.807011
H  2.515895 2.359924 2.094557
H  3.11464 3.59761 -0.048967
H  1.432989 3.882554 0.462839
H  -0.882508 -1.219307 -1.59327
H  -2.035624 0.130745 -1.812515
H  -2.475854 1.672601 0.105291
H  -1.639066 1.378336 1.661807
H  -2.419947 -2.350211 -0.016509
H  -3.238006 -2.025627 -1.574304
H  -4.012727 0.660458 1.761021
H  -2.893516 -0.711798 2.019268
H  1.731264 -1.508837 1.233237
H  0.340245 -2.15026 0.349817
H  -4.383166 -0.033869 -0.605517
H  -4.704073 -1.433962 0.448819
H  3.294543 -2.385969 -0.566231
H  1.901952 -3.064442 -1.431747
H  1.383045 -4.55667 0.569822
H  2.78964 -3.877064 1.433476
H  3.036115 -4.850532 -0.045631
