program: Gaussian 09
title: 000203362
version: EM64L-G09RevD.01
frameworkgroup: C1[X(C14H18N2)]
method: RPBEPBE
basis: SDD
operation: Freq
keyword: #p
keyword: freq=noraman
keyword: PBEPBE/SDD
title: #p freq=noraman PBEPBE/SDD
converged: NO NO NO NO
title: Mulliken charges:
elementType: N N C C C C C C C C C C C C C C H H H H H H H H H H H H H H H H H H
charge: -0.054938 -0.054939 -0.353339 -0.353339 -0.428251 -0.428251 -0.107333 -0.107335 -0.107359 -0.107357 -0.169208 -0.169207 -0.169191 -0.169192 -0.124100 -0.124100 0.244001 0.243999 0.244002 0.243998 0.269553 0.269578 0.269555 0.269576 0.293641 0.293641 0.293640 0.293640 0.295668 0.295668 0.295670 0.295670 0.307970 0.307970
chargesum: 2.00000
title: Mulliken charges with hydrogens summed into heavy atoms:
elementType: N N C C C C C C C C C C C C C C
charge: -0.054938 -0.054939 0.134661 0.134661 0.110880 0.110880 0.186308 0.186306 0.186281 0.186282 0.126461 0.126462 0.126478 0.126477 0.183870 0.183871
polarizability: 2.13403255e+02 -1.38954007e-04 1.50594508e+02 2.59503820e+01 2.16926260e-04 8.51757367e+01
1716.lowfreq: -35.3971 -7.5973 -6.0522 -0.0007 0.0002 0.0005 16.4893 26.5080 33.4980
frequency: 16.4893 23.9895 26.5080 43.1629 82.8184 85.3400 107.0458 184.8485 196.7776 325.6623 346.6057 365.9677 371.1587 393.1346 393.1688 478.4316 487.3487 578.3945 601.2168 641.1657 641.2534 687.8491 690.3469 754.2518 773.3257 777.8019 792.3326 803.4990 805.7013 858.3737 858.8945 917.4907 951.6670 952.7551 987.4381 987.5409 1004.9737 1014.5988 1018.0502 1027.5680 1027.6186 1046.8453 1048.6640 1049.4060 1061.1274 1067.8905 1077.4881 1143.3862 1163.3854 1163.5282 1175.3829 1188.8485 1194.2719 1219.7474 1220.5859 1246.9442 1270.4171 1292.9122 1302.7216 1332.8002 1355.1342 1355.1477 1364.8531 1374.2917 1380.0563 1381.0197 1461.1856 1463.1981 1475.7743 1476.9512 1477.1478 1483.7492 1500.5485 1503.6049 1568.7302 1568.8558 1621.6643 1621.7340 2983.1740 2991.7054 3031.8996 3032.7733 3033.3933 3054.9750 3098.6328 3101.0944 3182.1070 3182.1120 3187.7184 3187.7348 3193.7542 3193.7747 3203.3553 3203.3645 3210.2518 3210.2717
redmass: 3.7625 2.9488 3.8946 4.5134 5.0997 2.4531 1.9657 4.1608 5.1591 3.5520 3.7940 2.3939 2.4435 2.6724 2.6728 4.0016 3.5160 5.8580 4.5513 6.3427 6.3391 1.9534 1.9014 1.0702 1.9458 1.6010 1.1864 4.7180 3.1933 1.2713 1.2705 1.3257 1.3384 1.3495 1.3911 1.3910 4.6583 5.0894 4.7320 1.3782 1.3780 3.3643 2.3975 2.6428 1.7934 3.7313 1.6421 1.5781 4.5180 4.5671 1.1927 1.0768 1.0886 1.1688 1.1687 1.3619 1.2394 1.2752 1.0616 1.2253 1.4599 1.4529 1.2535 1.4229 2.6572 2.5137 1.4101 1.4591 1.1322 2.2650 2.2600 1.2449 1.2430 1.1872 5.7581 5.7500 5.0050 5.0236 1.0600 1.0592 1.1024 1.0604 1.0598 1.1051 1.1076 1.1069 1.0913 1.0913 1.0908 1.0908 1.0960 1.0960 1.0990 1.0990 1.1037 1.1037
irintensity: 0.0061 0.0000 0.0028 0.3160 0.0000 0.6146 0.0000 2.2842 0.0000 0.0000 0.0066 0.0585 0.0000 0.0000 0.0404 15.4320 0.0000 0.0000 3.9935 0.0000 0.5342 0.0000 124.9496 7.0091 104.0765 0.0000 0.0000 0.0000 21.4616 0.0036 0.0000 0.0730 0.0000 3.1914 0.0000 0.0033 5.7765 0.0000 12.0802 0.0001 0.4589 0.0000 6.1349 0.0000 0.0000 0.0000 6.7068 0.0000 103.8214 0.0003 7.0633 0.0000 0.0024 6.5968 0.0000 0.0000 12.7886 0.0030 0.0000 0.0000 0.0021 3.2771 6.3253 0.0000 0.0000 1.2880 16.1976 0.0000 0.0000 0.0008 109.1087 25.3941 0.0000 32.2166 0.0000 0.8138 73.8449 0.0158 0.0000 22.0288 0.0000 0.0001 15.2060 13.0391 0.0000 10.1453 0.0226 0.0090 0.0004 0.0229 5.2613 0.0057 0.3377 13.9629 6.6940 0.0066
temp: 298.150 k
press: 1.00000 atm
elementType: 7 7 6 6 6 6 6 6 6 6 6 6 6 6 6 6 1 1 1 1 1 1 1 1 1 1 1 1 1 1 1 1 1 1
symmnumber: 1
zpe: 771978.1 jmol-1
zpe.correction: 0.294031 hartree
zpe.thermalcorrener: 0.308683 hartree
zpe.thermalcorrenthalpy: 0.309628 hartree
zpe.thermalcorrgfe: 0.248202 hartree
zpe.sumelectzpe: -652.070838 hartree
zpe.sumelectthermal: -652.056186 hartree
zpe.sumelectthermalent: -652.055241 hartree
zpe.sumelectthermalfe: -652.116667 hartree
dipole: 0.0000 0.0001 0.0000
dipole: 0.0001
quadrupole: 94.0262 -63.9460 -89.8495
quadrupole: 0.0000 5.3010 0.0001
quadrupole: 113.9493 -44.0230 -69.9264 0.0000 5.3010 0.0001
hfenergy: -652.364869 hartree
pointgroup: C01 [X(C14H18N2)]
dipole: -0.0000002 -0.0000496 0.0000002 debye
polarizability: 213.2202827|-0.0002095|150.5945076|-26.3979331|-0.0013154|85.3587085 unknown
InChI: InChI=1S/C14H18N2/c1-3-9-15(10-4-1)13-7-8-14-16-11-5-2-6-12-16/h1-6,9-12H,7-8,13-14H2
charge 2 multiplicity 1
34 atoms
N  -3.163672 0.000819 -0.45595
N  3.163713 0.000885 0.456044
C  -0.730829 0.000885 0.25819
C  0.73087 0.00087 -0.258096
C  -1.732625 0.000852 -0.922316
C  1.732666 0.000939 0.92241
C  -3.809403 1.198076 -0.234196
C  3.809446 1.198132 0.23424
C  -3.809565 -1.196457 -0.23478
C  3.809604 -1.196402 0.234925
C  -5.136316 1.221628 0.217293
C  5.13636 1.221661 -0.21725
C  -5.136485 -1.220047 0.216699
C  5.136524 -1.220014 -0.216554
C  -5.815812 0.00078 0.447805
C  5.815853 0.000802 -0.447711
H  -0.907265 -0.888949 0.893643
H  -0.907253 0.890755 0.893595
H  0.907313 -0.889012 -0.893479
H  0.907287 0.890692 -0.893572
H  -1.588986 -0.888837 -1.55936
H  -1.589038 0.890533 -1.559386
H  1.589037 -0.888703 1.559523
H  1.589069 0.890667 1.559412
H  -3.244832 2.109715 -0.441321
H  3.244876 2.109779 0.441326
H  -3.245115 -2.108072 -0.442332
H  3.245152 -2.108007 0.442515
H  -5.627194 2.184591 0.375272
H  5.62724 2.184616 -0.375268
H  -5.627492 -2.183021 0.37421
H  5.627529 -2.182996 -0.374025
H  -6.853561 0.000768 0.79258
H  6.853603 0.000775 -0.792486
