program: Gaussian 09
title: 000203334
version: EM64L-G09RevD.01
frameworkgroup: C1[X(C6H9Cl)]
method: RPBEPBE
basis: SDD
operation: Freq
keyword: #pfreq=noraman
keyword: PBEPBE/SDD
title: #p freq=noraman PBEPBE/SDD
converged: YES YES NO NO
title: Mulliken charges:
elementType: Cl C C C C C C H H H H H H H H H
charge: -0.090226 -0.169326 -0.337034 -0.652451 -0.679849 0.338448 -0.501751 0.202915 0.225907 0.215226 0.250482 0.235195 0.213098 0.235273 0.229421 0.284673
chargesum: 0.00000
title: Mulliken charges with hydrogens summed into heavy atoms:
elementType: Cl C C C C C C
charge: -0.090226 -0.169326 0.091788 0.048451 -0.002057 0.338448 -0.217078
polarizability: 8.70406991e+01 4.29909131e+00 6.30774468e+01 -3.02194495e+00 7.75119086e-01 6.60883367e+01
1716.lowfreq: -18.0376 -9.9821 0.0026 0.0030 0.0034 18.1629 102.6179 141.9538 162.5905
frequency: 102.5824 141.9518 162.5836 200.8284 242.9961 246.1496 296.7210 332.7349 398.9949 410.3003 542.1210 562.8605 640.4565 661.3297 725.8054 798.1106 907.0741 998.1852 1031.6279 1057.8471 1105.8765 1149.3032 1215.3992 1276.1637 1333.6836 1386.9839 1392.7025 1444.2398 1459.2749 1469.1286 1472.2846 1487.2418 2131.1023 2975.3691 2992.1944 2992.6046 3046.0210 3087.5523 3091.6195 3099.0898 3121.9062 3426.4302
redmass: 2.2905 3.3203 3.1267 1.6322 1.7790 1.0995 3.0475 2.8552 4.7292 5.3854 3.9831 4.6526 1.2181 1.2631 2.6217 1.3231 1.8838 1.3673 1.7407 2.1238 1.9506 3.0389 2.5103 1.2911 1.4708 1.1888 1.2121 1.0720 1.0556 1.0489 1.0394 1.0505 6.0804 1.0619 1.0362 1.0374 1.0975 1.0995 1.0972 1.1005 1.1012 1.1585
irintensity: 0.3210 0.7006 1.1442 1.1441 1.6093 0.1968 2.4679 2.3967 9.1550 9.5300 20.4344 4.9523 73.8597 58.9681 14.0970 33.0181 6.4224 17.8306 16.9875 4.6815 19.9882 17.5510 22.1987 14.1816 7.5859 7.0452 25.0269 3.9944 9.1449 3.2194 17.5016 11.5192 2.7276 21.8362 33.8171 10.7800 9.3088 33.7076 13.6449 28.8995 16.5795 61.3100
temp: 298.150 k
press: 1.00000 atm
elementType: 17 6 6 6 6 6 6 1 1 1 1 1 1 1 1 1
symmnumber: 1
zpe: 338647.4 jmol-1
zpe.correction: 0.128984 hartree
zpe.thermalcorrener: 0.137893 hartree
zpe.thermalcorrenthalpy: 0.138837 hartree
zpe.thermalcorrgfe: 0.095836 hartree
zpe.sumelectzpe: -693.484090 hartree
zpe.sumelectthermal: -693.475181 hartree
zpe.sumelectthermalent: -693.474237 hartree
zpe.sumelectthermalfe: -693.517237 hartree
dipole: 1.2246 0.9321 1.9948
dipole: 2.5195
quadrupole: -46.4983 -50.0267 -49.1119
quadrupole: -0.9230 -3.2358 -1.4174
quadrupole: 2.0473 -1.4810 -0.5663 -0.9230 -3.2358 -1.4174
hfenergy: -693.613074 hartree
pointgroup: C01 [X(C6H9Cl1)]
dipole: -0.0873961 0.2634862 -0.9515804 debye
dipolederiv: -0.3358681 0.0785816 -0.1054665 0.1008859 -0.3682644 0.1599294 -0.1888819 0.2325816 -0.653223 0.5835685 -0.2092385 0.1048806 -0.2315571 0.5420116 -0.1811306 0.1532611 -0.2760853 0.8445674 0.039234 0.0023549 -0.0159975 0.0307731 0.008994 -0.0168161 0.0027952 0.0462448 -0.0210718 -0.0620847 -0.0159438 -0.0190891 -0.0253987 -0.0879109 -0.0144776 -0.0336045 -0.0112235 -0.0525705 0.003387 -0.0628992 -0.0224655 -0.0431256 -0.0264998 -0.0557097 0.0052404 -0.0291312 0.0205884 -0.1201153 -0.0061265 -0.0003332 -0.0325847 -0.1256967 0.0057348 0.1024696 -0.0635108 -0.1610404 -0.3824767 0.0540743 -0.0084419 0.0673121 -0.3408813 0.0025749 -0.0332718 0.0193488 -0.2667796 0.040738 -0.0352853 -0.0413797 -0.0228866 0.054741 0.0528625 -0.054152 0.0229758 -0.145489 -0.0506749 0.0924598 0.0371726 0.0811586 -0.0746006 -0.0295586 0.0015019 -0.0232915 0.0906558 0.0960382 0.0110225 -0.0515877 0.003442 0.0570601 0.0517529 -0.0588698 0.0407118 -0.1152714 -0.0343872 -0.0914939 0.0529225 -0.0813066 0.0473232 0.0036301 0.0688657 0.0438218 0.0693298 -0.0335089 0.1185389 0.0145675 0.1001151 -0.0094685 -0.0409084 0.0040574 -0.0226531 0.0939678 -0.1039241 -0.1073437 0.0893632 -0.1016196 0.0356987 0.0225175 0.1098773 0.0388956 0.0450519 0.1032854 0.0084794 -0.0351958 0.036514 0.0745636 0.0650916 -0.0780136 0.0024574 -0.0879194 0.0062139 0.1428754 -0.0052294 0.0982413 -0.0378071 -0.0229188 -0.0133502 -0.0133619 0.0846078 0.2505747 0.0199441 0.0062799 0.0200369 0.2507372 -0.0025741 0.0120755 -0.0077801 0.2545962 unknown
polarizability: 76.398917|-12.47464|72.8258473|2.9328649|-3.4322232|66.9817182 unknown
InChI: InChI=1S/C6H9Cl/c1-4-6(3,7)5-2/h1H,5H2,2-3H3
charge 0 multiplicity 1
16 atoms
Cl 0.472413 -1.155197 1.632813
C  0.020825 -0.481265 -0.159355
C  1.310221 0.164988 -0.723623
C  -0.416942 -1.724674 -0.95716
C  1.823181 1.398328 0.041065
C  -1.074634 0.473142 0.023614
C  -2.007323 1.273476 0.125676
H  1.084648 0.442397 -1.774614
H  2.087406 -0.621223 -0.754893
H  -0.695323 -1.422895 -1.984536
H  -1.286386 -2.209255 -0.486013
H  0.411762 -2.450342 -1.009742
H  2.72692 1.802485 -0.449172
H  2.081255 1.133356 1.080674
H  1.06077 2.196809 0.068156
H  -2.819792 1.96907 0.230011
