program: Gaussian 09
title: 000203460
version: EM64L-G09RevD.01
frameworkgroup: C1[X(C23H26Cl2O6)]
method: RPBEPBE
basis: SDD
operation: Freq
keyword: #p
keyword: freq=noraman
keyword: PBEPBE/SDD
title: #p freq=noraman PBEPBE/SDD
converged: YES YES NO NO
title: Mulliken charges:
elementType: Cl Cl O O O O O O C C C C C C C C C C C C C C C C C C C C C C C H H H H H H H H H H H H H H H H H H H H H H H H H H
charge: -0.067134 -0.067744 -0.253057 -0.286516 -0.235915 -0.287104 -0.246326 -0.241567 0.188631 0.191504 0.030798 -0.324507 0.234808 -0.709473 -0.707628 0.237466 -0.710114 -0.708180 -0.710252 0.385824 0.385340 -0.301567 -0.385134 -0.299869 -0.383875 -0.251405 -0.182091 -0.250125 -0.182038 -0.121851 -0.120376 0.257177 0.251995 0.237373 0.234811 0.234396 0.244291 0.226555 0.249381 0.244051 0.234822 0.234114 0.245760 0.226561 0.249791 0.245166 0.230107 0.253633 0.218126 0.261980 0.257911 0.261921 0.257528 0.254991 0.256447 0.254356 0.256228
chargesum: 0.00000
title: Mulliken charges with hydrogens summed into heavy atoms:
elementType: Cl Cl O O O O O O C C C C C C C C C C C C C C C C C C C C C C C
charge: -0.067134 -0.067744 -0.253057 -0.286516 -0.235915 -0.287104 -0.246326 -0.241567 0.188631 0.191504 0.287975 0.164861 0.234808 0.004025 0.012360 0.237466 0.004583 0.013338 -0.008387 0.385824 0.385340 -0.039588 -0.127223 -0.037947 -0.126347 0.003586 0.074356 0.004231 0.074191 -0.121851 -0.120376
polarizability: 3.69167902e+02 1.80285785e+00 2.36246095e+02 2.29636413e+01 -1.16360386e-01 2.60725091e+02
1716.lowfreq: -4.4072 -2.8881 0.0007 0.0010 0.0011 5.6343 6.9659 14.0933 20.2763
frequency: 6.7900 12.4361 20.2517 21.7349 37.7889 53.9879 56.9494 69.4436 69.9961 73.8346 84.9092 103.9144 109.6864 126.7151 130.5279 136.4051 158.7989 162.4216 163.8787 189.8653 197.5812 209.1830 212.5295 218.0500 228.5584 245.2776 251.4138 263.0210 268.1533 289.9336 300.9995 304.6812 311.4452 321.6286 339.1542 341.0608 344.4975 374.9869 376.8436 378.4354 417.5107 417.6142 428.1639 445.5818 470.9232 482.8061 501.0302 501.6676 516.9908 536.1132 566.7281 574.7220 623.7158 624.6179 637.6906 638.1970 695.4921 695.5867 712.6390 715.9583 737.2688 749.9459 770.1524 786.9765 807.6010 808.7838 813.8544 823.4829 823.9096 858.3190 881.0713 891.2239 920.7910 928.9952 934.5270 936.3308 938.7040 941.6363 949.7061 953.7126 954.0667 966.8786 989.4193 989.6368 1010.9755 1012.3532 1071.4028 1072.2785 1072.9441 1096.3436 1110.4497 1111.6530 1120.6124 1126.2061 1138.2900 1153.0985 1158.5625 1180.4842 1180.5381 1203.0555 1203.4544 1215.6387 1216.9690 1238.8496 1243.1470 1246.7073 1292.5782 1292.7507 1294.4846 1331.8798 1366.5494 1366.6111 1366.9962 1384.2379 1384.9670 1397.6246 1400.2748 1401.3074 1404.4493 1404.8867 1435.9812 1450.9650 1451.7526 1460.6040 1460.8587 1464.2524 1467.4737 1467.9703 1472.7576 1473.4362 1478.6422 1483.6878 1484.1142 1581.4967 1582.0885 1600.0216 1600.7075 1612.6810 1620.5617 2997.3434 3007.6636 3007.8910 3012.1991 3012.3015 3031.0850 3039.8723 3094.5630 3108.4518 3108.5834 3109.6793 3114.5831 3114.6376 3115.1953 3118.4181 3118.5985 3125.2226 3125.9524 3158.3580 3158.6359 3158.8090 3159.4180 3176.9140 3177.6550 3180.2298 3181.3058
redmass: 9.6073 6.2294 7.7696 6.4394 5.4284 4.1097 4.2676 6.1936 5.3019 4.6503 6.5944 6.0352 6.7569 5.0045 5.4950 4.2789 2.5054 1.0945 1.3049 4.3904 1.7280 2.3620 1.3117 1.3964 1.7088 3.6940 2.6883 3.4748 4.3911 4.3136 4.0699 4.2376 5.8415 4.5665 3.9659 4.3903 5.5643 3.6421 3.0851 3.8611 3.1073 3.1231 3.7690 4.5289 4.0646 4.2332 2.8901 2.8764 3.9686 4.8795 4.7836 4.2539 6.4360 6.4084 6.0067 5.9029 3.7627 3.7554 7.0625 7.0569 5.9861 5.6639 3.8674 4.4522 1.8098 1.2743 2.3123 1.5243 1.5308 3.5076 3.2224 3.4774 2.2888 1.6659 1.4329 1.4882 1.6096 1.5897 1.9371 1.3423 1.3414 2.7650 4.0369 4.0314 1.3133 1.3195 2.3619 2.5432 2.4746 3.0229 1.3830 1.3406 2.9214 2.4082 2.1872 2.2428 2.3490 1.1692 1.1647 3.7161 3.7442 4.0702 4.1651 2.4089 1.5435 2.4280 1.2725 1.2726 1.3654 1.2809 4.4619 1.6195 4.5323 1.2014 1.2037 1.2137 1.2896 1.4179 3.0707 2.5307 1.0935 1.0539 1.0539 1.0647 1.0743 1.0516 1.3808 1.2990 1.6362 1.4622 1.0486 1.0600 1.0603 7.3068 7.3228 6.8709 6.7553 10.5344 10.1277 1.0363 1.0348 1.0348 1.0359 1.0358 1.0650 1.0792 1.1000 1.1011 1.1011 1.1009 1.1003 1.1007 1.1052 1.0996 1.0995 1.1003 1.1004 1.0884 1.0882 1.0886 1.0890 1.0963 1.0966 1.0972 1.0967
irintensity: 0.2610 0.4408 0.7913 0.0550 0.0195 1.7067 1.7901 1.1456 1.8276 0.1624 2.1930 1.8042 0.0065 1.0593 3.0620 0.6549 0.7786 0.0355 0.8720 0.8042 0.2393 2.9371 0.7783 0.2852 2.6172 0.1532 1.8989 3.6212 7.7661 2.7934 2.4201 6.0710 4.6043 2.8510 1.2920 9.9340 17.4939 6.2125 11.4513 1.2378 0.0593 0.0596 8.5406 4.4354 5.0788 1.6620 8.2503 25.1801 1.4490 3.9132 7.8250 9.3655 7.1111 0.5944 43.2075 55.3469 0.3181 0.8587 12.5478 3.0412 5.5041 8.4501 9.5306 14.7090 19.5707 14.9358 0.9114 61.4115 85.9635 10.2398 5.0825 69.1875 15.6828 3.5256 2.9591 0.8673 6.2338 4.2089 21.7015 0.1025 0.1053 23.3200 58.9520 22.6837 3.5929 8.7186 206.9038 24.9780 62.1118 353.0236 11.6099 38.3446 104.0274 22.2993 6.2731 149.8160 277.5794 21.5017 14.8008 21.9018 70.7976 147.7477 106.6071 14.1415 0.5666 42.5819 1.5716 3.1965 2.8081 6.5642 11.2894 0.4215 10.0708 21.5128 20.9883 24.4020 10.2077 34.6107 0.4687 11.3262 17.3651 19.7345 5.6257 5.7474 25.0442 7.9426 155.6325 18.0017 69.2051 185.8885 9.0513 36.9451 15.4629 14.9429 11.8754 48.0649 12.9655 143.8344 100.0435 12.4254 8.4930 6.6636 13.1666 14.1518 14.8568 4.6051 16.1505 1.5641 0.6859 12.5811 52.5894 15.0522 7.8315 7.4925 29.3277 11.3400 14.4482 5.5237 3.9825 0.1159 1.4558 6.0052 5.8284 0.4550 0.6503
temp: 298.150 k
press: 1.00000 atm
elementType: 17 17 8 8 8 8 8 8 6 6 6 6 6 6 6 6 6 6 6 6 6 6 6 6 6 6 6 6 6 6 6 1 1 1 1 1 1 1 1 1 1 1 1 1 1 1 1 1 1 1 1 1 1 1 1 1 1
symmnumber: 1
zpe: 1157780.2 jmol-1
zpe.correction: 0.440975 hartree
zpe.thermalcorrener: 0.473786 hartree
zpe.thermalcorrenthalpy: 0.474730 hartree
zpe.thermalcorrgfe: 0.372761 hartree
zpe.sumelectzpe: -2261.192092 hartree
zpe.sumelectthermal: -2261.159281 hartree
zpe.sumelectthermalent: -2261.158337 hartree
zpe.sumelectthermalfe: -2261.260306 hartree
dipole: -0.2788 0.5344 -0.0317
dipole: 0.6036
quadrupole: -243.6819 -187.3209 -192.2887
quadrupole: 1.3893 -13.3187 0.2328
quadrupole: -35.9180 20.4429 15.4751 1.3893 -13.3187 0.2328
hfenergy: -2261.6330671 hartree
pointgroup: C01 [X(C23H26Cl2O6)]
dipole: 0.1141705 0.1915426 0.0816349 debye
polarizability: 362.5577578|-15.172001|239.5253493|31.2972655|-9.2308452|264.0559806 unknown
InChI: InChI=1S/C23H26Cl2O6/c1-15(29-21(27)23(4,5)31-19-12-8-17(25)9-13-19)14-28-20(26)22(2,3)30-18-10-6-16(24)7-11-18/h6-13,15H,14H2,1-5H3
charge 0 multiplicity 1
57 atoms
Cl 7.894933 -2.371807 1.464469
Cl -8.118464 -0.717471 -2.698543
O  1.507714 -0.344129 -0.748948
O  3.812602 1.173288 -1.22022
O  -1.627725 -0.579996 0.237064
O  -3.905315 0.556874 1.433156
O  1.187802 0.867628 1.217665
O  -1.259622 1.466767 -0.814707
C  2.614016 1.804867 -0.594383
C  -2.666448 1.366074 1.23961
C  0.654626 -1.481553 -0.255851
C  -0.78543 -1.293248 -0.761891
C  1.707309 0.743581 0.083556
C  3.027693 2.903538 0.400859
C  1.851522 2.38818 -1.802373
C  -1.790311 0.790249 0.095844
C  -3.007386 2.845901 0.989016
C  -1.908729 1.173365 2.569734
C  1.307046 -2.75126 -0.8102
C  4.703087 0.369164 -0.489607
C  -4.822535 0.329078 0.39247
C  4.563817 -0.023893 0.866405
C  5.821557 -0.075429 -1.240892
C  -4.670623 0.719194 -0.962689
C  -5.983185 -0.37957 0.796651
C  5.539551 -0.861296 1.457025
C  6.793235 -0.907385 -0.653076
C  -5.678185 0.396024 -1.901731
C  -6.986137 -0.700911 -0.137501
C  6.638565 -1.291948 0.694905
C  -6.820128 -0.306222 -1.481126
H  0.660331 -1.459532 0.849733
H  -0.790534 -0.744186 -1.720194
H  -1.281279 -2.2705 -0.871941
H  3.664001 3.635121 -0.124778
H  2.131464 3.418345 0.784976
H  3.584622 2.507896 1.264368
H  2.458231 3.187482 -2.260177
H  1.671608 1.598191 -2.547965
H  0.877686 2.798316 -1.487082
H  -3.612065 3.216791 1.833511
H  -2.080088 3.43911 0.924443
H  -3.571768 3.000502 0.056313
H  -2.496101 1.624531 3.387042
H  -1.774199 0.099124 2.770008
H  -0.914314 1.647747 2.523793
H  1.269016 -2.770404 -1.913612
H  2.364226 -2.799864 -0.502435
H  0.787147 -3.64567 -0.42297
H  3.720943 0.300885 1.481308
H  5.908981 0.237968 -2.285231
H  -3.792184 1.26539 -1.314257
H  -6.078764 -0.673889 1.845815
H  5.436761 -1.165365 2.502748
H  7.654635 -1.249541 -1.233726
H  -5.56573 0.695869 -2.947657
H  -7.87978 -1.248465 0.175178
