program: Gaussian 09
title: 000203350
version: EM64L-G09RevD.01
frameworkgroup: C1[X(C18H21NO2S)]
method: RPBEPBE
basis: SDD
operation: Freq
keyword: #p
keyword: freq=noraman
keyword: PBEPBE/SDD
title: #p freq=noraman PBEPBE/SDD
converged: YES YES NO NO
title: Mulliken charges:
elementType: S O O N C C C C C C C C C C C C C C C C C C H H H H H H H H H H H H H H H H H H H H H
charge: 0.172921 -0.294541 -0.258412 -0.095790 -0.357417 0.450994 -0.277397 0.097141 -0.901457 0.171067 -0.333943 -0.349166 -0.616484 -0.613544 -0.234967 -0.237197 -0.180455 -0.242465 -0.248368 -0.202157 -0.215284 -0.237632 0.217603 0.223671 0.238730 0.233371 0.269393 0.341472 0.237218 0.274382 0.223110 0.191314 0.227329 0.230265 0.194852 0.222551 0.232255 0.235903 0.263561 0.254752 0.232258 0.229420 0.231142
chargesum: 0.00000
title: Mulliken charges with hydrogens summed into heavy atoms:
elementType: S O O N C C C C C C C C C C C C C C C C C C
charge: 0.172921 -0.294541 -0.258412 -0.095790 0.083857 0.450994 0.194704 0.097141 -0.290592 0.171067 -0.096725 -0.074784 0.025269 0.034124 -0.002711 -0.001294 -0.180455 0.021097 0.006384 0.030101 0.014136 -0.006489
polarizability: 2.53593748e+02 -4.92999125e+01 2.10132536e+02 -1.51249886e+01 -1.54052324e+01 2.00945892e+02
1716.lowfreq: -10.6839 -4.8861 -0.0011 0.0012 0.0018 4.0773 13.8331 21.2247 24.4051
frequency: 13.2417 20.9892 24.2124 26.8633 34.5225 46.6178 55.8582 66.6030 90.4568 99.8267 129.6688 161.0596 192.4672 213.0111 216.9950 245.0544 254.4166 270.2202 297.4890 319.9303 347.3510 354.0400 380.4988 387.9999 405.7567 413.1470 433.9839 463.8026 475.4696 490.6971 529.8316 567.9999 610.7555 612.7281 650.9772 677.8970 683.0143 696.9391 735.2462 754.5898 772.3575 784.9650 801.8043 817.1091 829.2772 852.4984 893.0816 894.7495 906.9076 930.2870 975.5058 980.4767 985.9790 997.8685 1001.2554 1014.7172 1024.2156 1032.0095 1037.4332 1059.3542 1069.0998 1069.7518 1072.7563 1074.8773 1091.0180 1096.8218 1139.8243 1157.8032 1170.6144 1180.0386 1180.3909 1186.9765 1210.5456 1234.3876 1236.7258 1260.1818 1270.2966 1292.8433 1297.2289 1298.3165 1327.6412 1371.0850 1378.0459 1382.5674 1422.4397 1424.1619 1431.8906 1440.4079 1443.0873 1448.3222 1457.7062 1462.1357 1469.0225 1475.7262 1477.2919 1479.6540 1486.8897 1570.3358 1583.9180 1586.5259 1596.5724 1612.7502 2857.0462 2868.7437 2900.2157 3019.4562 3028.3701 3042.7287 3047.5812 3048.1560 3078.5227 3088.4714 3124.5614 3126.6540 3130.5954 3137.4557 3139.6129 3150.0097 3154.1779 3158.5071 3163.2775 3169.5243 3170.0872
redmass: 5.5551 4.9691 4.3732 2.9083 4.1719 4.9289 4.6918 5.6203 4.5879 2.9117 4.6151 4.1695 2.2198 1.9376 1.4756 1.6981 3.5758 3.9516 4.6104 3.7244 2.6206 3.4996 3.0209 8.8778 2.8387 2.6016 3.5620 3.6219 4.1468 3.3048 5.1284 5.6538 6.4672 4.8366 5.8795 6.6307 4.4920 2.2092 3.0303 1.4948 2.3388 1.7466 1.7684 4.5012 3.2102 1.2492 1.6073 1.6487 6.1574 1.4093 1.3899 1.3947 6.2123 1.3158 1.3429 3.3749 3.5780 2.6372 1.5993 2.1466 1.6198 1.9589 2.3802 2.5106 1.3327 1.9833 1.4875 1.1384 1.0546 1.0681 1.1121 1.6868 2.5319 1.1774 3.3647 1.6888 2.2455 1.4458 1.3243 1.1997 1.3625 9.4639 1.8870 2.9303 1.1409 2.0782 2.2445 1.1292 1.1333 1.1320 2.0511 1.0496 1.0584 1.0556 2.3978 1.0955 1.0542 6.7788 6.2547 6.0601 8.3454 6.6457 1.0564 1.0570 1.0688 1.0732 1.0740 1.0844 1.0652 1.0643 1.1007 1.1003 1.0867 1.0850 1.1085 1.0885 1.0895 1.0929 1.0940 1.0968 1.0996 1.1000 1.1011
irintensity: 0.2498 0.0957 0.4305 0.1922 0.4272 0.8483 1.9870 0.4210 2.1299 0.2991 0.2592 1.0446 1.6165 0.9670 1.5119 1.4644 3.1813 3.8306 1.1321 2.2500 11.3894 19.5397 1.6991 0.8225 0.0566 5.1534 4.7007 1.9982 1.9540 16.4431 0.6906 3.3606 0.1148 12.4464 2.2858 3.2863 47.9155 38.3678 5.7294 71.5497 28.5254 26.8930 7.0766 1.1672 8.4851 0.7413 2.6383 0.5481 36.5773 2.7347 2.5076 0.4607 3.3382 0.2345 0.5064 6.9193 58.7658 144.9983 21.3995 11.6291 2.4769 51.6274 0.9435 10.2250 11.2527 52.4352 0.9962 5.2997 0.0303 1.6145 1.1586 2.1622 8.2316 9.8175 215.8823 18.0968 19.1818 13.0174 1.0553 1.0357 4.7599 0.4629 7.0817 17.8143 2.3122 8.3573 17.0036 0.7024 13.5858 9.3626 27.8992 14.7950 6.3408 23.2525 4.5630 19.5431 9.7338 12.7521 1.0829 4.4435 123.3102 24.1562 85.1725 149.0324 77.0748 42.5298 38.5507 14.6769 20.6174 20.0706 31.0837 45.1286 3.6252 0.8146 10.8558 4.6206 10.7158 15.8131 13.1917 23.7536 5.1140 26.6023 11.1257
temp: 298.150 k
press: 1.00000 atm
elementType: 16 8 8 7 6 6 6 6 6 6 6 6 6 6 6 6 6 6 6 6 6 6 1 1 1 1 1 1 1 1 1 1 1 1 1 1 1 1 1 1 1 1 1
symmnumber: 1
zpe: 912550.4 jmol-1
zpe.correction: 0.347572 hartree
zpe.thermalcorrener: 0.369893 hartree
zpe.thermalcorrenthalpy: 0.370837 hartree
zpe.thermalcorrgfe: 0.291367 hartree
zpe.sumelectzpe: -1300.134298 hartree
zpe.sumelectthermal: -1300.111977 hartree
zpe.sumelectthermalent: -1300.111033 hartree
zpe.sumelectthermalfe: -1300.190503 hartree
dipole: -1.4200 -1.3771 -0.4524
dipole: 2.0292
quadrupole: -125.0998 -134.5938 -133.4116
quadrupole: -10.8209 2.3299 2.6201
quadrupole: 5.9352 -3.5587 -2.3765 -10.8209 2.3299 2.6201
hfenergy: -1300.4818699 hartree
pointgroup: C01 [X(C18H21N1O2S1)]
dipole: 0.7495474 -0.1412102 -0.2357508 debye
polarizability: 181.3133185|-4.3983517|285.7054774|22.6443131|-1.5231833|197.653381 unknown
InChI: InChI=1S/C18H21NO2S/c1-19(2)12-13-21-18(20)17-11-7-6-8-15(17)14-22-16-9-4-3-5-10-16/h3-11H,12-14H2,1-2H3
charge 0 multiplicity 1
43 atoms
S  -2.855698 1.23416 -1.369181
O  0.877253 -0.298967 -0.839601
O  1.501053 0.005483 1.3777
N  3.127581 -3.344882 -0.955194
C  2.754669 -1.915455 -1.056714
C  -0.292827 2.428454 -0.841614
C  1.261372 -1.738113 -0.724681
C  0.594997 1.905763 0.154124
C  -1.025384 1.604183 -1.874567
C  1.018587 0.47444 0.314687
C  -0.55108 3.827314 -0.831509
C  1.161447 2.786068 1.120804
C  4.219765 -3.733811 -1.869118
C  3.385818 -3.780582 0.433933
C  0.030749 4.692165 0.114524
C  0.891955 4.165464 1.10629
C  -2.616749 -0.19576 -0.224817
C  -2.353486 0.022954 1.148307
C  -2.742317 -1.514379 -0.724869
C  -2.198574 -1.081878 2.018053
C  -2.597314 -2.615567 0.150558
C  -2.320591 -2.400641 1.521783
H  2.927229 -1.575553 -2.093893
H  3.363313 -1.264307 -0.384729
H  1.023657 -2.086009 0.293994
H  0.630963 -2.256679 -1.462259
H  -1.152805 2.166626 -2.814538
H  -0.553431 0.63648 -2.073057
H  -1.240104 4.233172 -1.581758
H  1.818684 2.351404 1.880664
H  4.367723 -4.828032 -1.821158
H  5.19891 -3.246512 -1.630031
H  3.950433 -3.473316 -2.907909
H  2.534607 -3.51938 1.085017
H  4.304496 -3.31537 0.872246
H  3.508973 -4.878185 0.460399
H  -0.188248 5.765268 0.08425
H  1.347186 4.822918 1.854383
H  -2.275636 1.046063 1.529406
H  -2.957817 -1.669468 -1.787243
H  -1.983071 -0.90963 3.078054
H  -2.701865 -3.635376 -0.236718
H  -2.205824 -3.254425 2.199079
