program: Gaussian 09
title: 000203458
version: EM64L-G09RevD.01
frameworkgroup: C1[X(C22H24Cl2O6)]
method: RPBEPBE
basis: SDD
operation: Freq
keyword: #p
keyword: freq=noraman
keyword: PBEPBE/SDD
title: #p freq=noraman PBEPBE/SDD
converged: YES YES NO NO
title: Mulliken charges:
elementType: Cl Cl O O O O O O C C C C C C C C C C C C C C C C C C C C C C H H H H H H H H H H H H H H H H H H H H H H H H
charge: -0.074082 -0.074278 -0.303631 -0.303411 -0.280269 -0.280114 -0.234471 -0.234598 0.185391 0.185316 -0.698075 -0.699940 -0.698048 -0.699930 0.262333 0.262161 -0.277417 -0.277001 0.307396 0.306844 -0.318969 -0.319073 -0.347038 -0.346872 -0.205027 -0.205008 -0.178429 -0.177632 -0.105573 -0.105575 0.221145 0.252266 0.241070 0.235848 0.243588 0.226069 0.220859 0.252404 0.241052 0.236045 0.243729 0.225859 0.259193 0.226031 0.259254 0.226015 0.294306 0.294227 0.248362 0.248260 0.254289 0.254368 0.265394 0.265387
chargesum: 0.00000
title: Mulliken charges with hydrogens summed into heavy atoms:
elementType: Cl Cl O O O O O O C C C C C C C C C C C C C C C C C C C C C C
charge: -0.074082 -0.074278 -0.303631 -0.303411 -0.280269 -0.280114 -0.234471 -0.234598 0.185391 0.185316 0.016406 0.005566 0.016266 0.005703 0.262333 0.262161 0.207808 0.208269 0.307396 0.306844 -0.024663 -0.024846 -0.098677 -0.098612 0.049261 0.049360 0.086965 0.087755 -0.105573 -0.105575
polarizability: 3.24810999e+02 -4.62558016e-01 2.08050043e+02 1.90534560e-01 3.17325621e+01 2.53659586e+02
1716.lowfreq: -11.4697 -7.5973 -4.2326 -0.0021 -0.0015 -0.0011 8.0443 17.4343 18.8069
frequency: -2.2607 17.4075 17.8520 24.8867 28.6607 38.7873 48.5373 60.7151 64.2891 70.4503 75.1402 85.3888 103.1702 143.9827 152.5276 160.5312 171.2440 194.4711 199.3529 210.0420 229.7770 244.0784 245.4709 248.8455 250.6386 265.1073 276.7021 288.3832 289.2972 313.7051 317.4646 322.3389 322.9259 330.6657 342.6852 347.6644 411.5662 412.0327 412.8667 416.7522 417.8849 427.0811 454.4049 460.1846 481.4888 542.4805 546.3457 569.1023 571.6065 622.2225 622.5783 624.5921 624.8388 700.2350 700.5082 707.7507 709.5897 731.7663 738.4410 752.0684 782.6841 820.6735 821.6725 834.9451 839.8327 845.4500 847.5089 871.3860 874.5509 921.9382 922.3875 940.1790 940.6618 946.9089 949.5707 965.9151 967.1587 992.3995 994.4654 994.6406 1008.9581 1009.4037 1021.5682 1048.5262 1063.6629 1064.1551 1076.0165 1095.2255 1095.3595 1118.7899 1150.2775 1150.9016 1163.8825 1164.5181 1187.0864 1187.8408 1196.6465 1197.2762 1215.2170 1216.0709 1227.4873 1255.1807 1279.1769 1279.6125 1348.6985 1358.1640 1359.5318 1359.5680 1375.1353 1375.6909 1387.7697 1388.1720 1393.7570 1394.5473 1449.8043 1452.8324 1453.9233 1454.3303 1459.8599 1461.2951 1462.4468 1463.9296 1470.5798 1471.2503 1483.4450 1484.0107 1582.5402 1582.7247 1586.0233 1587.1799 1646.0795 1647.8704 2999.9141 3000.0994 3004.6615 3004.6879 3018.1997 3026.5954 3092.0706 3096.5335 3096.9384 3099.6737 3108.1619 3108.3031 3114.7577 3114.7968 3120.1103 3120.2396 3155.7410 3156.0344 3159.5935 3159.6603 3175.7690 3176.1728 3185.9691 3186.0388
redmass: 4.5585 10.6348 5.3355 5.7841 5.8994 5.4471 5.5891 6.8583 5.8863 7.6617 6.8737 8.1210 5.4046 4.5333 5.6032 5.6050 5.2277 1.2283 1.5840 2.0901 3.4713 1.1754 2.0979 2.3896 1.1920 4.9589 5.6519 4.1781 3.9566 3.8846 2.9524 3.5497 4.4466 3.7303 3.7997 4.2877 4.7342 5.1344 5.5220 3.4452 3.2799 6.4433 3.5876 3.8184 2.7716 3.6340 3.3142 3.7213 3.9231 6.3128 6.9923 5.4015 5.6232 5.2887 5.2134 5.0060 5.1873 4.4720 4.2286 3.8959 5.7819 1.2827 1.2537 3.7225 1.9107 1.8394 2.8760 3.2054 3.4299 2.1142 2.1320 1.6252 1.6097 1.3898 1.3766 1.3391 1.3367 2.4304 4.2102 4.1040 1.3214 1.3208 2.5468 4.8452 2.5006 2.4809 4.1037 1.3126 1.3103 2.8241 2.1899 2.1243 1.4617 1.5248 2.6014 2.7742 3.8110 3.7862 2.7532 2.8424 1.1384 1.1100 1.2531 1.2529 1.2742 1.4530 5.9704 5.9566 1.2006 1.2008 3.3722 3.4171 1.2319 1.2293 1.0830 1.0741 1.0568 1.0578 1.2921 1.6354 1.6367 1.2942 1.0571 1.0567 1.0586 1.0601 8.0966 8.0884 6.4176 6.3708 11.1441 10.9490 1.0357 1.0357 1.0346 1.0346 1.0557 1.0597 1.1077 1.1008 1.1008 1.1063 1.1006 1.1006 1.0999 1.0999 1.1003 1.1003 1.0886 1.0886 1.0903 1.0903 1.0973 1.0972 1.0962 1.0962
irintensity: 1.0363 0.3472 0.2044 2.2647 0.1915 0.0808 1.0603 0.1821 0.0990 0.4634 0.2374 1.7673 1.7455 0.0044 0.0236 0.2027 1.6576 0.7174 0.7424 3.3013 0.5309 0.3688 0.8281 1.1653 0.3417 1.2825 0.0513 8.1686 6.1183 1.5069 5.3933 3.8767 0.7752 4.1058 5.9254 16.4344 1.1283 0.9915 12.9028 2.1739 0.1094 1.6449 45.9878 1.6019 5.2184 0.5656 32.8995 15.2059 2.5028 15.4308 4.9930 22.3555 26.8060 4.1285 14.2215 8.3764 4.8726 0.4228 18.0469 2.2767 10.8366 10.1185 1.4358 1.1664 115.5359 13.2580 25.3392 37.2821 41.6670 8.2785 7.2477 6.3157 3.8660 1.0270 0.2586 7.7661 1.5910 9.5285 75.4250 19.6088 1.9706 1.8049 6.6417 255.2276 30.9428 64.4466 522.7873 16.5042 3.8930 43.3272 162.6172 68.5186 16.7968 15.2174 31.2692 48.3366 4.6980 8.0070 34.0454 7.3195 1.6898 14.2412 0.4305 2.3505 0.5867 0.7383 0.6872 0.6618 25.6902 21.2626 1.8905 0.5337 25.1458 0.9036 7.3508 31.6413 9.1239 10.1862 22.4944 133.0468 90.3192 62.1879 18.6542 17.4378 17.7432 35.6736 0.4549 0.0182 2.8521 0.9194 32.7977 248.0798 8.3519 8.4058 24.2133 2.4804 0.5299 72.1757 7.1135 30.0461 3.1734 9.1557 16.8696 15.4637 2.6308 4.7218 15.8976 32.2032 4.7903 1.5625 3.3640 1.0595 3.1099 0.1477 1.5780 3.0312
temp: 298.150 k
press: 1.00000 atm
elementType: 17 17 8 8 8 8 8 8 6 6 6 6 6 6 6 6 6 6 6 6 6 6 6 6 6 6 6 6 6 6 1 1 1 1 1 1 1 1 1 1 1 1 1 1 1 1 1 1 1 1 1 1 1 1
symmnumber: 1
zpe: 1083405.3 jmol-1
zpe.correction: 0.412647 hartree
zpe.thermalcorrener: 0.442982 hartree
zpe.thermalcorrenthalpy: 0.443927 hartree
zpe.thermalcorrgfe: 0.349113 hartree
zpe.sumelectzpe: -2221.957614 hartree
zpe.sumelectthermal: -2221.927278 hartree
zpe.sumelectthermalent: -2221.926334 hartree
zpe.sumelectthermalfe: -2222.021147 hartree
dipole: -5.7700 0.0464 0.0034
dipole: 5.7702
quadrupole: -175.1464 -203.7535 -185.5092
quadrupole: -0.1739 0.1241 16.0032
quadrupole: 12.9900 -15.6172 2.6272 -0.1739 0.1241 16.0032
hfenergy: -2222.3702608 hartree
pointgroup: C01 [X(C22H24Cl2O6)]
dipole: 0.0054939 0.0146743 2.2700987 debye
polarizability: 196.476738|-18.569081|265.2379182|0.8818043|0.349833|324.805972 unknown
InChI: InChI=1S/C22H24Cl2O6/c1-21(2,29-17-9-5-15(23)6-10-17)19(25)27-13-14-28-20(26)22(3,4)30-18-11-7-16(24)8-12-18/h5-12H,13-14H2,1-4H3
charge 0 multiplicity 1
54 atoms
Cl -1.193077 -2.31059 -4.678204
Cl 1.146718 2.27419 -4.687748
O  -3.248621 1.025965 -0.07466
O  3.247849 -1.035268 -0.085028
O  -1.16596 0.986211 2.997024
O  1.187691 -0.953446 3.001009
O  -2.475512 -0.697104 2.047932
O  2.505189 0.71096 2.030157
C  -2.372113 1.582891 0.991536
C  2.38159 -1.578356 0.996753
C  -1.0872 2.219576 0.42193
C  -3.275546 2.626127 1.685871
C  1.090893 -2.220915 0.4474
C  3.291237 -2.613761 1.694752
C  -2.03412 0.468304 2.020934
C  2.05534 -0.451484 2.016342
C  -0.743938 0.083689 4.100367
C  0.774837 -0.036351 4.095705
C  -2.691915 0.238257 -1.119979
C  2.681451 -0.253449 -1.129705
C  -2.62416 -1.169844 -0.994022
C  2.624989 1.156167 -1.015331
C  -2.337733 0.867132 -2.337401
C  2.305245 -0.890603 -2.336188
C  -2.175529 -1.949317 -2.084037
C  2.165308 1.92903 -2.105445
C  -1.884461 0.094512 -3.429306
C  1.840752 -0.124556 -3.428045
C  -1.806226 -1.302801 -3.279112
C  1.773824 1.274511 -3.289057
H  -1.359769 3.026242 -0.280428
H  -0.48609 2.644709 1.24142
H  -0.463653 1.485864 -0.116794
H  -3.528362 3.417207 0.960174
H  -4.213292 2.153481 2.023434
H  -2.758234 3.073349 2.55027
H  1.356346 -3.035508 -0.248494
H  0.497533 -2.636456 1.277394
H  0.462184 -1.492947 -0.093097
H  3.537614 -3.412984 0.975791
H  4.23189 -2.137424 2.018716
H  2.78154 -3.051341 2.568596
H  -1.232287 -0.898124 3.974012
H  -1.082222 0.559997 5.037601
H  1.262907 0.943307 3.952764
H  1.119827 -0.500114 5.036815
H  -2.922839 -1.633533 -0.050625
H  2.940496 1.626013 -0.080507
H  -2.425581 1.953776 -2.430512
H  2.384574 -1.978578 -2.421043
H  -2.120728 -3.038792 -2.001738
H  2.118922 3.019523 -2.032008
H  -1.592016 0.575987 -4.366697
H  1.531545 -0.612338 -4.356784
