program: Gaussian 09
title: 000203342
version: EM64L-G09RevD.01
frameworkgroup: C1[X(C19H25NO)]
method: RPBEPBE
basis: SDD
operation: Freq
keyword: #p
keyword: freq=noraman
keyword: PBEPBE/SDD
title: #p freq=noraman PBEPBE/SDD
converged: YES YES NO NO
title: Mulliken charges:
elementType: O N C C C C C C C C C C C C C C C C C C C H H H H H H H H H H H H H H H H H H H H H H H H H
charge: -0.452436 -0.285139 -0.094008 -0.009199 -0.438505 0.405410 0.423516 -0.763329 -0.054928 -0.379620 -0.422087 -0.438177 -0.386890 -0.703886 -0.689405 -0.235243 -0.253625 -0.230497 -0.250530 -0.245604 -0.242324 0.192877 0.238503 0.226937 0.223317 0.226152 0.247938 0.224393 0.208806 0.337514 0.244108 0.238327 0.275670 0.227745 0.205126 0.194522 0.236985 0.232463 0.210732 0.196059 0.223234 0.226529 0.223795 0.227486 0.226387 0.230903
chargesum: 0.00000
title: Mulliken charges with hydrogens summed into heavy atoms:
elementType: O N C C C C C C C C C C C C C C C C C C C
charge: -0.114922 -0.060746 0.098869 -0.009199 0.026936 0.405410 0.423516 -0.065923 0.153878 -0.135512 -0.183760 -0.162507 -0.159146 -0.067253 -0.050151 -0.012009 -0.027096 -0.006701 -0.023044 -0.019217 -0.011422
polarizability: 2.38551679e+02 -1.53448061e+01 2.22030891e+02 7.51840300e+00 -1.28981354e+01 1.72464250e+02
1716.lowfreq: -10.5632 -9.3648 -2.1480 -0.0002 0.0004 0.0007 28.5407 31.6971 36.6122
frequency: 28.0823 31.6555 36.2986 42.4294 51.6234 63.6321 94.3922 114.9600 144.3661 184.9576 199.1669 203.5536 208.3524 212.2942 235.0144 257.0092 263.4305 279.3296 281.9853 304.8538 323.6549 352.4486 372.6799 400.9921 406.5465 415.5950 437.4340 459.9587 472.5742 531.8909 550.9197 614.7025 616.2429 621.4112 631.7935 658.7023 703.8492 707.9324 710.7401 761.7363 771.7378 826.6678 848.5579 860.7935 876.9253 888.8166 908.0638 911.8568 917.4675 928.4144 934.7371 936.6821 942.5751 963.5793 973.3861 982.5525 989.9990 990.6336 994.1051 998.2525 1026.7383 1029.6837 1061.8386 1079.7278 1085.5057 1101.6516 1106.7059 1125.2081 1130.9925 1164.5211 1170.4440 1172.2684 1174.2119 1184.5954 1185.7992 1197.2311 1206.0754 1237.3374 1269.4185 1293.5784 1307.5577 1311.2138 1317.3607 1324.9597 1332.6958 1362.2480 1372.9758 1375.8727 1379.1429 1383.0177 1388.2499 1432.0581 1432.8201 1444.5804 1463.2270 1463.8201 1473.4060 1475.8538 1479.9253 1482.3249 1483.4526 1486.2669 1492.0743 1588.3131 1589.9492 1607.3431 1610.7069 2922.9342 2965.6537 2965.9500 2971.1520 2978.2215 2988.1596 3041.5710 3058.0892 3068.4654 3072.6301 3088.6368 3092.5325 3093.1110 3098.8377 3118.2968 3125.5486 3125.7678 3137.8966 3138.5968 3151.3684 3151.5274 3162.9837 3164.9443 3399.7080 3555.3365
redmass: 3.8144 3.6193 2.9130 3.2947 4.1161 4.3842 3.8467 2.8632 2.9505 2.0634 2.9710 1.4092 1.2084 3.3471 2.5188 1.4083 1.4999 2.3307 2.4048 3.4159 4.3213 3.6454 2.3967 2.8391 2.8671 3.6819 2.6356 2.1891 3.0795 3.1425 3.5512 6.4215 6.2617 2.5338 5.3036 2.2173 2.0513 2.4892 1.7545 1.9115 2.0605 2.3155 1.2551 1.2464 2.7446 3.5099 1.4142 1.4579 1.8624 1.4887 1.4747 1.6054 2.0167 2.1232 1.4550 1.5559 4.1781 3.8865 1.4115 1.3473 2.1499 2.2170 1.6836 1.6017 1.6204 2.4594 2.5321 2.0845 2.1996 2.3411 1.1066 1.6201 1.2685 1.6033 1.3170 1.2292 3.2442 1.5502 1.3145 1.4027 1.4418 1.3418 1.3995 1.2910 1.3642 1.3097 1.2301 3.9952 8.5171 1.4323 1.2288 2.2049 2.2410 1.1695 1.0511 1.0529 1.2372 1.6760 1.1120 1.9388 1.0677 1.0575 1.0775 5.9989 6.2025 6.0705 6.0523 1.0692 1.0359 1.0818 1.0457 1.0756 1.0350 1.0904 1.0985 1.0972 1.0994 1.1001 1.1001 1.1000 1.0885 1.0847 1.0870 1.0860 1.0912 1.0929 1.0949 1.0941 1.1006 1.1008 1.0735 1.0657
irintensity: 0.3877 1.0368 0.2066 0.2666 0.8045 0.4775 0.3012 1.1622 3.8872 21.0750 37.3175 57.5212 8.1079 0.0743 19.8987 2.0520 0.3855 0.7100 1.2667 6.4390 4.3635 5.6017 2.1156 0.1887 0.6112 3.6827 1.5402 1.5842 4.0196 12.8876 10.1142 0.1724 0.6205 44.8159 26.1946 36.8502 52.1247 35.3313 38.9837 60.5467 38.9100 9.7359 0.1155 0.1596 3.3484 14.4325 5.5465 5.2625 24.2215 6.2074 6.7691 7.1943 18.8236 19.6702 0.9880 0.1186 0.9505 0.4014 0.3510 0.1122 5.5247 9.0738 6.1671 9.6432 2.5558 7.9081 85.5038 13.9242 8.6115 15.0540 2.0155 22.3905 7.1829 25.7748 16.0890 5.2868 14.6268 30.9403 18.9256 37.8675 4.3791 1.0912 6.5014 5.2073 6.5466 15.2325 5.7559 6.3637 0.4961 25.6068 27.2316 7.8566 9.9193 25.5126 1.5442 5.5075 11.5008 22.0845 14.4943 7.1638 6.0531 23.0444 2.7221 2.6536 0.2513 7.8728 1.8559 87.3817 29.5378 19.3078 23.7007 26.9706 25.3610 20.1382 5.1140 102.5969 42.3853 17.4233 33.9132 32.1655 12.8893 3.4317 2.0286 1.1606 13.2933 28.0882 23.3563 37.7355 28.3881 18.3108 4.4552 5.4419
temp: 298.150 k
press: 1.00000 atm
elementType: 8 7 6 6 6 6 6 6 6 6 6 6 6 6 6 6 6 6 6 6 6 1 1 1 1 1 1 1 1 1 1 1 1 1 1 1 1 1 1 1 1 1 1 1 1 1
symmnumber: 1
zpe: 1028416.8 jmol-1
zpe.correction: 0.391703 hartree
zpe.thermalcorrener: 0.413226 hartree
zpe.thermalcorrenthalpy: 0.414170 hartree
zpe.thermalcorrgfe: 0.340298 hartree
zpe.sumelectzpe: -867.406198 hartree
zpe.sumelectthermal: -867.384675 hartree
zpe.sumelectthermalent: -867.383731 hartree
zpe.sumelectthermalfe: -867.457604 hartree
dipole: 0.6135 2.1713 -0.5026
dipole: 2.3116
quadrupole: -119.5909 -124.3886 -121.9390
quadrupole: -2.5834 3.9365 -2.5728
quadrupole: 2.3819 -2.4158 0.0338 -2.5834 3.9365 -2.5728
hfenergy: -867.7979012 hartree
pointgroup: C01 [X(C19H25N1O1)]
dipole: -0.184053 0.7974873 0.3965588 debye
polarizability: 240.1022823|10.5891407|211.143626|13.5897066|22.2408645|181.8009123 unknown
InChI: InChI=1S/C19H25NO/c1-15(2)20-14-16(3)19(21,17-10-6-4-7-11-17)18-12-8-5-9-13-18/h4-13,15-16,20-21H,14H2,1-3H3
charge 0 multiplicity 1
46 atoms
O  -0.176525 0.112337 -2.006662
N  3.140594 -1.274885 0.241343
C  0.684491 -1.042115 -0.085063
C  -0.426463 -0.039313 -0.545791
C  2.096531 -0.568283 -0.535012
C  -1.836249 -0.633073 -0.309454
C  -0.35171 1.356406 0.127746
C  0.438789 -2.482296 -0.587697
C  4.53098 -1.194157 -0.278222
C  -2.416885 -0.607015 0.984726
C  0.501764 1.668876 1.213986
C  -2.553295 -1.24307 -1.367023
C  -1.218549 2.376285 -0.351097
C  5.425019 -2.142091 0.5473
C  5.121423 0.244224 -0.30872
C  -3.685767 -1.181021 1.216391
C  0.509218 2.962171 1.78608
C  -3.828861 -1.808463 -1.139192
C  -1.210024 3.670515 0.208856
C  -4.399975 -1.782107 0.153289
C  -0.339591 3.971863 1.282356
H  0.655756 -1.066804 1.025194
H  2.224642 -0.827619 -1.601352
H  2.168217 0.540428 -0.474547
H  -0.444972 -2.944936 -0.11619
H  0.29078 -2.48868 -1.682253
H  1.329792 -3.088207 -0.34743
H  3.106207 -1.029642 1.243174
H  4.493154 -1.571114 -1.320993
H  -0.701023 0.882753 -2.343466
H  -1.881695 -0.124179 1.81105
H  1.167279 0.905841 1.629129
H  -2.095565 -1.280511 -2.360693
H  -1.942512 2.15027 -1.146232
H  6.459653 -2.151808 0.159125
H  5.466617 -1.818103 1.606468
H  5.022611 -3.169341 0.518842
H  4.481575 0.929321 -0.894024
H  6.129416 0.24905 -0.764846
H  5.21043 0.648601 0.718801
H  -4.120946 -1.152407 2.222002
H  1.179526 3.178675 2.625694
H  -4.372356 -2.275368 -1.968822
H  -1.890021 4.437072 -0.179433
H  -5.387812 -2.22214 0.330989
H  -0.331767 4.974264 1.724372
