program: Gaussian 09
title: 000203346
version: EM64L-G09RevD.01
frameworkgroup: C1[X(C24H29NO)]
method: RPBEPBE
basis: SDD
operation: Freq
keyword: #p
keyword: freq=noraman
keyword: PBEPBE/SDD
title: #p freq=noraman PBEPBE/SDD
converged: YES YES NO NO
title: Mulliken charges:
elementType: O N C C C C C C C C C C C C C C C C C C C C C C C C H H H H H H H H H H H H H H H H H H H H H H H H H H H H H
charge: -0.283934 -0.081850 -0.087694 -0.590668 -0.560462 -0.507833 0.405829 0.373214 0.403074 0.388407 -0.337628 -0.484656 -0.469190 -0.483413 -0.474774 -0.238285 -0.240656 -0.237051 -0.237788 -0.250040 -0.360972 -0.363116 -0.370469 -0.391419 -0.386777 -0.399142 0.259956 0.277573 0.243222 0.236880 0.229965 0.206315 0.202144 0.245082 0.245329 0.239384 0.241306 0.222558 0.222827 0.222584 0.222768 0.197498 0.190393 0.194758 0.215747 0.172287 0.205937 0.212694 0.166833 0.190825 0.204668 0.203585 0.191466 0.213674 0.189035
chargesum: 0.00000
title: Mulliken charges with hydrogens summed into heavy atoms:
elementType: O N C C C C C C C C C C C C C C C C C C C C C C C C
charge: -0.283934 -0.081850 0.172262 -0.313095 -0.317240 -0.040987 0.405829 0.373214 0.403074 0.388407 0.070831 -0.239575 -0.223861 -0.244029 -0.233468 -0.015727 -0.017829 -0.014466 -0.015020 0.137851 0.049533 0.015109 0.009058 0.004074 0.008274 0.003567
polarizability: 3.01976825e+02 -1.90550820e+01 2.64366669e+02 1.78555943e+01 1.04291660e+01 2.05059967e+02
1716.lowfreq: -9.5732 -4.3710 -1.7269 -0.0004 -0.0003 0.0005 11.2160 23.6572 33.5707
frequency: 9.3099 23.4942 32.5613 46.6774 56.8122 67.5349 110.4688 116.7267 129.5098 130.8526 139.9143 164.6167 189.0818 217.7940 235.3852 264.8454 290.2789 315.1348 322.4976 347.4480 362.9871 368.4277 389.0319 405.9844 424.0787 444.9160 449.1147 464.4280 479.2108 505.6648 512.2791 549.6137 572.2107 578.1708 605.2001 623.2730 641.9876 710.0861 752.6371 756.2578 757.2642 760.9911 773.1267 784.5054 796.9022 800.1686 811.3144 830.2381 844.9053 852.3505 856.2213 874.2437 880.2918 898.4173 903.2309 917.4851 927.8172 942.3958 943.7742 958.0000 959.0054 982.3937 983.3532 994.6788 1011.2689 1023.2813 1023.7582 1038.8110 1049.2174 1050.7885 1059.5643 1072.5764 1092.0738 1100.2055 1107.5856 1115.6735 1118.6819 1125.6961 1150.9695 1156.9876 1159.0939 1168.1077 1169.5968 1170.8915 1171.7857 1176.4546 1189.6073 1198.8038 1205.8042 1213.9509 1218.3679 1221.8711 1244.5200 1258.8855 1264.7659 1271.3417 1280.0475 1282.0946 1291.8975 1294.5228 1313.6952 1318.8545 1328.8572 1331.1997 1337.9870 1340.8057 1346.6882 1351.1520 1364.9806 1380.6911 1392.8073 1395.9525 1407.0516 1443.3109 1450.8191 1451.2244 1459.4144 1462.2247 1462.9515 1463.3548 1466.8977 1468.2560 1474.6836 1481.1053 1482.1139 1489.2027 1592.3739 1597.9965 1612.2670 1620.7233 2816.0457 2826.7796 2887.3089 2913.2847 2933.6315 2964.1858 2967.5783 2984.8596 2985.5117 2986.5483 2990.1718 3021.5456 3023.8189 3028.5890 3035.2757 3045.6151 3045.6779 3045.9702 3054.9503 3059.4253 3076.6373 3116.3462 3116.6341 3123.1493 3123.4346 3137.2635 3137.6360 3157.5701 3158.1417
redmass: 4.7865 4.5341 2.8551 4.2732 3.9634 4.5035 3.3595 2.4573 4.1835 4.0866 3.8244 3.2824 3.4474 2.7038 1.8703 2.6840 3.7322 2.7855 2.5692 4.0750 2.7505 4.3018 2.0265 3.6608 4.0423 2.9766 2.9843 2.9123 3.8311 4.2138 3.7343 3.4887 2.1047 3.7503 4.0181 4.5927 6.4473 4.9210 1.7145 3.1849 3.0169 1.5071 2.7555 3.7340 2.5658 1.4852 1.2544 2.4609 3.0235 1.8926 1.8485 1.4924 1.6773 2.8483 2.3181 2.8151 3.0437 1.4133 1.5608 2.1125 1.5186 1.3170 1.3169 2.5149 2.2260 2.2468 2.2256 3.1319 2.0967 2.5297 3.3601 2.5744 2.7443 1.5395 1.8016 2.1062 1.6201 2.0328 1.3382 1.2868 2.2400 1.5051 1.0876 1.1764 2.4077 1.3369 1.2587 1.2629 1.7480 1.6797 1.9497 1.3819 1.6919 1.2407 1.1833 1.9653 1.2859 1.2784 1.3736 1.3612 1.3181 1.4364 1.3248 1.3983 1.4101 1.4217 1.4527 1.4504 1.4137 1.4145 7.2466 5.8480 1.4823 2.3662 2.4764 1.0907 1.0881 1.1368 1.7157 1.2971 1.0846 1.0995 1.0906 1.1378 2.3172 1.0828 6.1539 7.1452 6.9717 7.1499 1.0717 1.0700 1.0698 1.0551 1.0560 1.1043 1.0621 1.0646 1.0764 1.0844 1.0612 1.0879 1.0874 1.0907 1.0934 1.0993 1.0891 1.0946 1.1036 1.1010 1.0879 1.0856 1.0854 1.0893 1.0893 1.0940 1.0940 1.1003 1.1003
irintensity: 0.0512 0.1076 0.0824 0.0074 0.7412 0.3732 4.8097 0.5715 1.1755 2.8226 0.6841 2.7777 1.0772 0.6858 0.7267 1.2234 1.3060 1.6457 1.6618 1.6040 3.5869 0.0022 2.3561 4.1994 2.2080 2.6892 0.1684 1.5687 2.4748 1.7030 0.5796 34.3783 2.9797 0.2529 1.1222 8.5821 3.4324 2.6267 12.9331 14.3723 8.5211 88.2552 14.7696 2.4416 6.7145 0.3062 0.3351 0.4239 1.3424 3.5110 8.5382 0.3564 0.7547 0.6772 1.4521 13.4795 1.1478 0.2885 1.2780 1.7660 4.3272 0.0045 0.0128 12.9846 1.4345 5.9407 5.9249 63.4194 93.2462 59.4489 14.6814 52.5322 12.7364 8.4471 5.6127 23.7277 4.8121 7.4213 5.4775 5.3901 31.9538 0.6131 0.6914 1.6546 10.6352 7.0169 1.5129 3.5986 7.1572 2.0395 6.1836 1.6942 7.1553 2.1096 4.1551 4.1657 4.0508 6.7887 8.9671 6.4708 28.7934 0.2176 0.2830 0.9208 1.2155 0.3987 0.1874 2.1804 0.5596 8.2364 0.0322 0.5626 0.1741 10.5190 0.2586 7.0480 13.4582 6.5656 25.3054 20.4891 2.1306 23.8425 2.6286 8.8480 7.8090 5.4955 2.0139 0.0136 0.0407 0.3388 44.9826 142.2691 85.0891 36.1459 76.6384 40.2458 38.5386 21.6025 54.7138 26.1803 47.5789 21.7846 55.4295 70.2604 27.2195 60.5708 27.4710 19.5121 98.8403 44.7402 8.4571 0.7530 8.0542 3.8203 2.1418 5.6989 61.5268 57.2554 23.3470
temp: 298.150 k
press: 1.00000 atm
elementType: 8 7 6 6 6 6 6 6 6 6 6 6 6 6 6 6 6 6 6 6 6 6 6 6 6 6 1 1 1 1 1 1 1 1 1 1 1 1 1 1 1 1 1 1 1 1 1 1 1 1 1 1 1 1 1
symmnumber: 1
zpe: 1240780.8 jmol-1
zpe.correction: 0.472588 hartree
zpe.thermalcorrener: 0.495051 hartree
zpe.thermalcorrenthalpy: 0.495996 hartree
zpe.thermalcorrgfe: 0.418495 hartree
zpe.sumelectzpe: -1060.000596 hartree
zpe.sumelectthermal: -1059.978133 hartree
zpe.sumelectthermalent: -1059.977189 hartree
zpe.sumelectthermalfe: -1060.054689 hartree
dipole: -1.0417 0.4656 0.7624
dipole: 1.3722
quadrupole: -145.5305 -151.0068 -151.7446
quadrupole: 0.3801 9.9693 2.6707
quadrupole: 3.8968 -1.5795 -2.3173 0.3801 9.9693 2.6707
hfenergy: -1060.4731842 hartree
pointgroup: C01 [X(C24H29N1O1)]
dipole: -0.4133413 0.1598588 0.3083254 debye
polarizability: 301.9952263|-20.043087|262.4308305|17.1788872|14.2533853|206.9774043 unknown
InChI: InChI=1S/C24H29NO/c1-6-12-25(13-7-1)14-15-26-17-18-16-23-19-8-2-4-10-21(19)24(18)22-11-5-3-9-20(22)23/h2-5,8-11,18,23-24H,1,6-7,12-17H2
charge 0 multiplicity 1
55 atoms
O  -1.227478 -0.882972 0.731389
N  -4.910395 -0.578239 0.137106
C  1.155336 -0.820049 1.184882
C  1.492962 -0.404349 -0.305696
C  3.424971 0.393736 1.279214
C  2.291279 -0.299945 2.131169
C  2.836123 -1.056686 -0.619307
C  1.694152 1.107199 -0.317101
C  3.883879 -0.629463 0.242712
C  2.747765 1.541986 0.53464
C  -0.219286 -0.299166 1.62362
C  3.090408 -2.007998 -1.625321
C  0.94523 2.045955 -1.05253
C  5.182865 -1.151378 0.096927
C  3.052419 2.911917 0.64646
C  4.398988 -2.532487 -1.77582
C  1.254905 3.425336 -0.945968
C  5.440457 -2.10632 -0.919037
C  2.304302 3.856458 -0.100986
C  -2.577503 -0.369949 0.99195
C  -3.529767 -1.111661 0.042176
C  -5.106259 0.643984 -0.685154
C  -5.949011 -1.597736 -0.160712
C  -6.489094 1.274794 -0.425676
C  -7.361937 -1.042177 0.114651
C  -7.612775 0.248994 -0.698011
H  1.120079 -1.924923 1.210297
H  0.68382 -0.733396 -0.976351
H  4.24895 0.737867 1.92805
H  2.726293 -1.13421 2.709334
H  1.892821 0.437953 2.853925
H  -0.252075 0.81205 1.564607
H  -0.427281 -0.598375 2.675901
H  2.282315 -2.338835 -2.288358
H  0.130411 1.709038 -1.704237
H  5.990419 -0.82004 0.760878
H  3.864884 3.246367 1.302697
H  4.605762 -3.268997 -2.560666
H  0.681752 4.16075 -1.522123
H  6.450378 -2.51356 -1.043344
H  2.541114 4.923957 -0.026168
H  -2.873607 -0.556137 2.04637
H  -2.603698 0.727834 0.815198
H  -3.118773 -1.054904 -0.995386
H  -3.536401 -2.179924 0.325329
H  -5.013259 0.404107 -1.7790
H  -4.308509 1.369764 -0.442899
H  -5.759514 -2.482383 0.475448
H  -5.893126 -1.936737 -1.230224
H  -6.612152 2.168307 -1.067839
H  -6.537274 1.608375 0.628872
H  -7.450481 -0.820987 1.195986
H  -8.115562 -1.814128 -0.134491
H  -8.601253 0.67868 -0.447826
H  -7.630866 0.004107 -1.78056
