program: Gaussian 09
title: 000203324
version: EM64L-G09RevD.01
frameworkgroup: C1[X(C16H20N2O3)]
method: RPBEPBE
basis: SDD
operation: Freq
keyword: #p
keyword: freq=noraman
keyword: PBEPBE/SDD
title: #p freq=noraman PBEPBE/SDD
converged: YES YES NO NO
title: Mulliken charges:
elementType: O O O N N C C C C C C C C C C C C C C C C H H H H H H H H H H H H H H H H H H H H
charge: -0.233643 -0.224737 -0.242125 -0.192088 -0.187032 0.065985 -0.529868 -0.538859 0.208034 0.167234 0.217215 -0.431239 -0.423975 -0.032471 -0.019349 -0.029812 -0.028679 -0.588942 -0.596553 -0.553919 -0.553400 0.237784 0.258489 0.257595 0.225319 0.245192 0.254354 0.240969 0.253438 0.235489 0.264702 0.249624 0.249214 0.215800 0.226898 0.220845 0.218881 0.218555 0.227899 0.218689 0.228488
chargesum: 0.00000
title: Mulliken charges with hydrogens summed into heavy atoms:
elementType: O O O N N C C C C C C C C C C C C C C C C
charge: -0.233643 -0.224737 -0.242125 -0.192088 -0.187032 0.065985 -0.033595 -0.055945 0.208034 0.167234 0.217215 0.068307 0.070432 0.203018 0.245353 0.219812 0.220535 -0.146244 -0.156827 -0.107465 -0.106223
polarizability: 2.24148600e+02 -1.15621592e+00 1.97042468e+02 -7.36108974e-01 7.43022043e+00 1.57283786e+02
1716.lowfreq: -11.0385 -6.6419 -4.0128 -0.0009 0.0002 0.0003 13.7013 30.0496 31.7537
frequency: 11.0454 29.9767 31.7003 36.8495 48.8802 62.2736 70.7495 73.1030 85.6126 87.6926 95.7421 149.7733 155.8052 164.2941 181.3441 213.3743 259.2098 278.4843 284.0305 314.0553 345.0510 363.7550 370.0802 380.4673 387.1508 395.1125 415.7684 436.6917 440.8588 455.1836 483.2753 523.4004 622.7572 631.0931 649.1217 658.9224 692.4902 707.0489 717.7699 746.0758 758.5253 845.4747 857.1446 885.6058 903.8002 912.7125 931.5055 935.4734 946.6766 953.9859 955.0686 962.1854 964.0342 966.6212 969.4972 997.7996 1008.6295 1010.2053 1011.9206 1015.7314 1034.5245 1065.8241 1109.8842 1117.8992 1144.5264 1173.7121 1180.1271 1193.8244 1229.7766 1256.6233 1266.4383 1283.7580 1285.7993 1291.0224 1292.3242 1303.7334 1310.6448 1323.1690 1329.0758 1342.3715 1364.5770 1373.4152 1423.1150 1425.8926 1428.0420 1428.5024 1442.8549 1446.6281 1447.3102 1460.9107 1581.4745 1582.9889 1640.2781 1655.3679 1658.1708 1660.2951 1660.3053 2965.0841 3012.6488 3039.8150 3040.9912 3052.0344 3078.2184 3087.0520 3090.0936 3091.0291 3091.2720 3100.9919 3108.1134 3108.2585 3124.5457 3124.8177 3125.0579 3196.6929 3197.6729 3201.5667 3201.8451
redmass: 5.2360 3.8130 4.4278 4.0316 4.6417 3.6259 3.1408 3.0510 2.8137 3.2804 2.9301 3.5774 3.9976 2.9866 2.7765 3.8366 2.7482 3.1297 3.2814 5.0849 3.7053 2.7420 3.9399 2.6319 2.7087 2.9345 3.1330 4.9480 2.5005 2.5499 2.3145 2.1204 4.3285 2.0288 1.8640 1.9717 5.6837 4.2590 7.4055 3.0098 4.3009 2.1623 2.1190 1.7545 1.9886 2.1013 1.8415 2.2350 1.9974 1.3973 1.3616 1.5766 1.3891 1.7152 2.7978 2.5800 1.1573 1.1889 1.1537 1.1791 2.4205 2.6290 2.3038 1.9472 3.6614 2.5352 3.0913 2.4275 1.3163 2.0083 1.3905 1.2514 1.2457 1.2734 1.3031 1.3992 1.3217 1.5952 1.5907 1.3048 2.3755 2.2876 1.1523 1.1576 1.1802 1.1949 1.1276 1.1239 1.1267 1.1055 10.7481 10.8621 9.5935 4.5889 4.6688 4.6461 4.6535 1.0635 1.0616 1.0600 1.0602 1.0972 1.0800 1.0609 1.0776 1.0602 1.0602 1.0952 1.0988 1.0983 1.0937 1.0999 1.0994 1.1141 1.1149 1.1149 1.1150
irintensity: 0.8045 0.1407 0.1666 0.5322 0.1225 0.2519 0.1269 0.1045 0.4290 0.1905 2.1679 2.7000 6.5632 0.2943 1.3448 3.8611 0.3029 0.0322 2.7165 20.4924 6.9817 2.4807 22.5273 4.1066 1.3413 2.7940 0.9845 6.0107 3.4961 13.1079 4.5254 6.1988 3.2828 14.9246 44.7145 17.7939 2.1482 2.3820 16.7864 16.8359 0.3471 5.4941 3.5136 11.1895 8.6480 6.9292 18.9374 1.1027 20.6007 75.9899 58.3260 35.8383 71.5105 55.0349 14.3629 20.6857 24.1110 26.1945 17.8009 22.7170 6.7222 23.7606 18.2852 4.4818 5.9325 18.0129 24.6316 26.6428 4.8838 156.0230 37.5773 7.9387 8.2591 21.3111 27.0263 20.0627 5.4086 21.8495 133.8334 8.6608 180.3502 210.8270 10.0672 20.9623 6.6856 4.8441 50.2339 64.6273 48.8443 24.7331 253.8987 463.6458 5.7183 6.6277 11.9921 0.6397 9.5297 17.3501 10.9404 12.7614 13.0020 6.0732 5.0069 9.5150 6.2716 6.3160 5.5134 8.2004 2.7377 3.7059 3.5678 3.1485 3.3505 19.5799 20.7247 20.0755 19.2133
temp: 298.150 k
press: 1.00000 atm
elementType: 8 8 8 7 7 6 6 6 6 6 6 6 6 6 6 6 6 6 6 6 6 1 1 1 1 1 1 1 1 1 1 1 1 1 1 1 1 1 1 1 1
symmnumber: 1
zpe: 861919.3 jmol-1
zpe.correction: 0.328288 hartree
zpe.thermalcorrener: 0.350848 hartree
zpe.thermalcorrenthalpy: 0.351792 hartree
zpe.thermalcorrgfe: 0.273116 hartree
zpe.sumelectzpe: -955.254837 hartree
zpe.sumelectthermal: -955.232277 hartree
zpe.sumelectthermalent: -955.231333 hartree
zpe.sumelectthermalfe: -955.310009 hartree
dipole: 0.1580 0.4184 -0.4764
dipole: 0.6534
quadrupole: -121.6340 -130.8224 -122.0978
quadrupole: 2.2618 -4.4724 0.3071
quadrupole: 3.2174 -5.9710 2.7536 2.2618 -4.4724 0.3071
hfenergy: -955.5831251 hartree
pointgroup: C01 [X(C16H20N2O3)]
dipole: -0.0522416 0.1968679 0.1568608 debye
polarizability: 223.7007536|0.1446913|192.8497651|-5.2823919|-14.3578124|161.9243357 unknown
InChI: InChI=1S/C16H20N2O3/c1-5-9-16(10-6-2)13(19)17(11-7-3)15(21)18(12-8-4)14(16)20/h5-8H,1-4,9-12H2
charge 0 multiplicity 1
41 atoms
O  -2.315182 -0.078169 -0.952493
O  1.622414 -1.654815 1.371413
O  1.387883 2.673393 -0.330762
N  -0.485093 1.305757 -0.592569
N  1.499146 0.504927 0.524289
C  -0.531316 -0.999575 0.437195
C  -0.657512 -2.38244 -0.289655
C  -1.303149 -1.046815 1.830257
C  -1.179245 0.084534 -0.430793
C  0.942211 -0.760471 0.798528
C  0.828294 1.55965 -0.139438
C  -1.171905 2.423673 -1.320785
C  2.925204 0.757283 0.916634
C  0.18417 -2.474887 -1.546672
C  -2.742088 -1.507728 1.744717
C  -1.819158 3.404334 -0.361277
C  3.878828 0.534926 -0.242331
C  -0.320151 -2.554544 -2.803558
C  -3.235209 -2.560009 2.444619
C  -3.158549 3.591288 -0.27052
C  4.809701 -0.449723 -0.268038
H  -0.340377 -3.154578 0.436197
H  -1.723667 -2.538345 -0.521896
H  -0.724789 -1.725153 2.483829
H  -1.261508 -0.032757 2.280393
H  -1.924399 1.953945 -1.972347
H  -0.404495 2.929105 -1.930848
H  3.147884 0.067843 1.745373
H  2.979115 1.802286 1.26581
H  1.27527 -2.491028 -1.39981
H  -3.404696 -0.929564 1.087421
H  -1.129835 3.989317 0.263074
H  3.791103 1.243765 -1.077085
H  0.333337 -2.630442 -3.680302
H  -1.401595 -2.544557 -2.987282
H  -4.291821 -2.843258 2.381016
H  -2.599581 -3.166096 3.102851
H  -3.588389 4.324755 0.421074
H  -3.861064 3.015286 -0.885119
H  5.496419 -0.565742 -1.114142
H  4.907191 -1.168074 0.554929
