program: Gaussian 09
title: 000203308
version: EM64L-G09RevD.01
frameworkgroup: C1[X(C9H15NO2)]
method: RPBEPBE
basis: SDD
operation: Freq
keyword: #p
keyword: freq=noraman
keyword: PBEPBE/SDD
title: #p freq=noraman PBEPBE/SDD
converged: YES YES NO NO
title: Mulliken charges:
elementType: O O N C C C C C C C C C H H H H H H H H H H H H H H H
charge: -0.213749 -0.214549 -0.345764 0.390212 -0.550793 -0.555184 -0.418220 -0.421144 0.122934 0.121182 -0.724355 -0.732020 0.254253 0.245011 0.246396 0.258710 0.217450 0.210322 0.196693 0.213636 0.224816 0.222670 0.224927 0.226851 0.226858 0.222831 0.350027
chargesum: 0.00000
title: Mulliken charges with hydrogens summed into heavy atoms:
elementType: O O N C C C C C C C C C
charge: -0.213749 -0.214549 0.004263 0.390212 -0.051529 -0.050078 0.009552 -0.010815 0.122934 0.121182 -0.051942 -0.055480
polarizability: 1.13372285e+02 3.07913241e+00 1.17162583e+02 -4.30033093e+00 5.53251921e+00 8.73006452e+01
1716.lowfreq: -19.2299 -0.0007 0.0003 0.0005 6.5090 13.1241 62.8097 89.4897 101.7727
frequency: 62.6121 89.4392 101.7426 119.6305 157.5838 171.7699 232.5278 252.4628 294.4087 310.4230 330.4882 335.8433 363.3733 406.5155 472.5837 495.8804 534.8684 564.0448 590.8991 597.1525 744.2995 762.0426 796.3021 804.7346 835.6139 893.2262 910.5672 913.8958 943.2993 1002.3393 1006.6195 1039.1633 1054.1919 1071.2903 1135.9877 1140.6664 1157.8596 1205.8585 1250.7381 1257.1518 1275.0841 1281.6524 1300.3811 1322.2331 1330.6151 1343.3139 1352.0432 1370.2248 1394.9440 1398.5901 1435.7273 1445.0864 1466.0763 1474.0529 1482.4651 1488.6675 1489.9153 1494.1055 1636.4064 1639.9811 2967.3205 2973.8700 2975.9987 2979.3341 2985.8723 2987.2021 3018.3778 3024.4403 3069.6693 3076.3153 3077.8290 3079.5440 3081.6322 3084.1210 3484.5880
redmass: 4.4902 2.9355 2.4091 2.5070 4.9548 1.9704 1.1190 1.7682 1.7922 2.0865 3.6839 3.1573 4.3870 3.0986 3.9189 3.1022 2.9667 3.6397 3.1618 3.5768 2.2750 1.2365 1.2618 1.3964 3.8356 2.1694 2.5740 2.5599 1.7890 1.8852 1.6321 1.6914 2.9681 2.1153 1.6106 1.5921 2.0169 1.8705 1.5440 2.4787 1.2787 1.6141 1.7164 2.1519 1.8251 1.4842 1.5809 1.8576 1.2164 1.2020 1.0831 1.0808 1.0598 1.0768 1.0479 1.0455 1.0463 1.0663 9.7073 5.8101 1.0612 1.0669 1.0651 1.0601 1.0375 1.0375 1.0994 1.0999 1.0946 1.0968 1.0971 1.0963 1.0980 1.0994 1.0760
irintensity: 0.0786 1.7199 0.4748 4.1210 3.3960 0.5786 0.0450 0.2074 0.8530 0.6793 2.2091 10.7237 4.0839 9.7249 13.1713 1.4268 3.3004 16.1984 4.1697 0.1211 2.8295 5.2939 58.3341 55.9810 6.4402 0.3947 2.1593 0.2988 11.3225 11.9702 1.1666 5.6016 0.4621 3.0406 17.2727 26.7661 10.5406 9.2253 4.2623 148.3821 6.9531 103.7069 31.0259 40.8409 41.2306 4.8060 2.6539 10.3597 16.2893 17.0018 6.2448 9.7905 3.0366 22.7008 11.6210 6.2809 8.7018 6.0077 182.8702 413.4715 29.5087 6.3446 32.1759 18.0197 24.4189 18.5376 23.5040 20.3769 9.3235 24.1568 26.5087 44.5510 48.1844 36.1416 36.0102
temp: 298.150 k
press: 1.00000 atm
elementType: 8 8 7 6 6 6 6 6 6 6 6 6 1 1 1 1 1 1 1 1 1 1 1 1 1 1 1
symmnumber: 1
zpe: 602306.5 jmol-1
zpe.correction: 0.229406 hartree
zpe.thermalcorrener: 0.241918 hartree
zpe.thermalcorrenthalpy: 0.242862 hartree
zpe.thermalcorrgfe: 0.191226 hartree
zpe.sumelectzpe: -556.245936 hartree
zpe.sumelectthermal: -556.233424 hartree
zpe.sumelectthermalent: -556.232480 hartree
zpe.sumelectthermalfe: -556.284117 hartree
dipole: 3.9114 -0.0231 -1.0128
dipole: 4.0404
quadrupole: -77.7446 -87.6452 -71.2997
quadrupole: -0.7496 -0.0006 -5.1812
quadrupole: 1.1519 -8.7487 7.5968 -0.7496 -0.0006 -5.1812
hfenergy: -556.4753424 hartree
pointgroup: C01 [X(C9H15N1O2)]
dipole: 1.5340755 0.002415 -0.4165494 debye
polarizability: 113.1570112|2.8829945|117.6540687|-4.8151944|4.2235807|87.0244329 unknown
InChI: InChI=1S/C9H15NO2/c1-3-9(4-2)5-7(11)10-8(12)6-9/h10H,3-6H2,1-2H3
charge 0 multiplicity 1
27 atoms
O  -2.242472 -2.154461 -0.374673
O  -1.962097 2.344134 0.687331
N  -2.045343 0.103931 0.105303
C  0.80597 -0.002628 -0.234473
C  -0.10671 -1.059826 -0.923372
C  0.064975 1.365498 -0.305328
C  1.058879 -0.367139 1.265203
C  2.13612 0.076674 -1.046613
C  -1.527652 -1.117674 -0.380943
C  -1.369699 1.340278 0.210479
C  1.822997 -1.684917 1.520143
C  3.199135 1.060205 -0.511211
H  0.312045 -2.077229 -0.850243
H  -0.179552 -0.829403 -2.007187
H  0.02528 1.715736 -1.358401
H  0.591025 2.147581 0.267637
H  0.08573 -0.410007 1.79455
H  1.616035 0.468103 1.733048
H  1.884487 0.353123 -2.091727
H  2.578271 -0.93788 -1.099222
H  1.281617 -2.563317 1.124837
H  2.829875 -1.6709 1.065512
H  1.952266 -1.844182 2.605916
H  2.822022 2.098259 -0.472608
H  3.540273 0.785386 0.503005
H  4.086841 1.057807 -1.169375
H  -3.013817 0.084445 0.449413
