program: Gaussian 09
title: 000203300
version: EM64L-G09RevD.01
frameworkgroup: C1[X(C13H15N3O2S)]
method: RPBEPBE
basis: SDD
operation: Freq
keyword: #p
keyword: freq=noraman
keyword: PBEPBE/SDD
title: #p freq=noraman PBEPBE/SDD
converged: NO YES NO NO
title: Mulliken charges:
elementType: S O O N N N C C C C C C C C C C C C C H H H H H H H H H H H H H H H
charge: 0.135010 -0.199331 -0.199567 -0.220368 -0.607356 -0.308013 -0.361030 -0.367684 -0.333096 0.180735 0.179849 0.083653 0.083337 -0.662363 -0.354054 -0.354021 -0.211657 -0.211593 -0.080779 0.238338 0.238368 0.225562 0.224094 0.213709 0.214002 0.285782 0.285376 0.269666 0.269636 0.238587 0.238569 0.317594 0.327092 0.221952
chargesum: 0.00000
title: Mulliken charges with hydrogens summed into heavy atoms:
elementType: S O O N N N C C C C C C C C C C C C C
charge: 0.135010 -0.199331 -0.199567 -0.220368 0.037330 -0.086061 0.115676 0.081973 0.094614 0.180735 0.179849 0.083653 0.083337 -0.091206 -0.084388 -0.084385 0.026930 0.026977 -0.080779
polarizability: 2.64401269e+02 -1.36305921e+00 1.62407398e+02 2.83216977e+01 -2.23448854e-01 1.36090840e+02
1716.lowfreq: -25.2381 -9.1059 -5.5714 -3.8020 -0.0014 -0.0009 -0.0008 2.3449 22.7781
frequency: -21.7153 -3.7693 22.6973 25.7763 46.0987 70.7983 81.3776 113.4172 122.0834 136.9981 156.9973 175.8035 229.4618 250.9949 260.6495 320.8793 328.0495 342.1139 367.2141 389.0685 405.9724 431.6433 455.6540 463.2839 522.9935 538.9981 559.4164 598.3860 605.7146 658.7712 676.6757 698.8866 710.5387 719.2075 733.6656 739.9379 764.2352 785.2163 795.8305 839.1453 900.9848 906.5561 946.9986 974.2771 991.0749 1005.8752 1013.0224 1016.6370 1032.5865 1038.8783 1048.6972 1071.9210 1076.5912 1076.8905 1167.3763 1170.5458 1202.1843 1202.9778 1231.1953 1260.6554 1275.5044 1283.1752 1291.7865 1293.2153 1329.8635 1335.6422 1350.4924 1370.0849 1416.0964 1443.4592 1447.4814 1453.3816 1455.7327 1468.7729 1482.0217 1612.4345 1614.9481 1618.1225 1628.7679 1638.1284 1677.7654 2975.8483 2990.7320 3013.2419 3023.9778 3045.2206 3051.4672 3082.9744 3121.3429 3138.7629 3152.4308 3164.0980 3173.9956 3357.2196 3528.8519 3677.5167
redmass: 3.3936 6.5802 4.2529 5.7223 3.7501 5.8639 2.3381 2.2412 9.1522 4.9743 5.6294 7.7419 4.2725 5.7350 3.3308 7.0051 1.0513 4.7678 4.5366 1.2579 3.2611 4.0429 4.8884 6.2519 7.2137 6.7057 3.3002 3.3719 6.9254 4.7945 5.0072 5.3379 5.5380 3.3786 1.3431 1.1336 1.2930 5.2551 1.6842 2.9534 1.6852 1.3915 7.1705 1.4135 1.8258 1.3458 2.2111 2.4140 2.9470 1.9878 2.8858 2.3324 2.4230 1.4123 1.2080 2.0292 1.8352 2.8831 1.2281 1.3236 1.9817 1.4901 1.1041 1.5026 1.2221 3.5765 1.5795 1.6015 5.9830 1.1041 1.2705 2.4641 2.0336 1.0736 1.0987 1.4799 7.6225 8.1257 11.2754 2.7604 11.7450 1.0590 1.0588 1.0581 1.1014 1.0574 1.1042 1.1064 1.1085 1.0864 1.0906 1.0956 1.1004 1.0767 1.0448 1.1043
irintensity: 0.0084 0.3210 4.3743 1.7544 11.1377 0.2192 0.2847 2.8308 6.3681 0.0002 8.4394 0.5248 0.1531 0.8869 2.8658 23.8582 14.3940 1.8778 1.7562 305.3227 2.3913 2.4372 0.0002 6.1483 9.3525 2.0657 15.7846 65.1608 12.2180 0.0140 0.2358 12.4993 31.4566 47.7772 50.9082 41.8060 1.4843 0.0234 31.7190 3.8537 22.5111 0.0514 20.8035 2.1780 155.6316 0.0193 0.1014 57.3698 4.4109 10.9727 0.7911 19.0152 2.6112 7.0419 8.8964 3.9290 6.0202 16.7559 9.7342 5.0188 201.1065 0.4258 6.0544 44.9749 8.6152 292.2816 22.6866 50.8777 9.9128 7.6159 17.0339 11.3405 7.5498 0.9318 15.0779 110.8581 1.2878 111.0347 341.4540 247.3442 40.9919 11.5474 15.6135 34.1300 4.4653 8.9245 18.1562 12.2427 14.2609 1.7560 5.5528 6.1848 21.8373 25.4930 33.4156 20.9287
temp: 298.150 k
press: 1.00000 atm
elementType: 16 8 8 7 7 7 6 6 6 6 6 6 6 6 6 6 6 6 6 1 1 1 1 1 1 1 1 1 1 1 1 1 1 1
symmnumber: 1
zpe: 690634.9 jmol-1
zpe.correction: 0.263049 hartree
zpe.thermalcorrener: 0.280507 hartree
zpe.thermalcorrenthalpy: 0.281451 hartree
zpe.thermalcorrgfe: 0.215383 hartree
zpe.sumelectzpe: -1215.782411 hartree
zpe.sumelectthermal: -1215.764953 hartree
zpe.sumelectthermalent: -1215.764009 hartree
zpe.sumelectthermalfe: -1215.830077 hartree
dipole: -0.1705 0.1045 1.2403
dipole: 1.2563
quadrupole: -54.2273 -131.5838 -117.3383
quadrupole: -1.1548 4.4054 -0.2799
quadrupole: 46.8225 -30.5340 -16.2885 -1.1548 4.4054 -0.2799
hfenergy: -1216.0454603 hartree
pointgroup: C01 [X(C13H15N3O2S1)]
dipole: -0.072427 -0.1437273 -0.4673457 debye
polarizability: 263.8003604|-5.4672575|161.1876961|-29.1743169|-5.4419011|137.9114508 unknown
InChI: InChI=1S/C13H15N3O2S/c14-13(15)19-8-4-3-7-16-11(17)9-5-1-2-6-10(9)12(16)18/h1-2,5-6,14H,3-4,7-8,15H2
charge 0 multiplicity 1
34 atoms
S  -5.465758 0.177371 0.752816
O  1.515003 2.430543 0.230429
O  1.502005 -2.190816 1.136083
N  1.192481 0.147914 0.821465
N  -7.899388 -0.082726 -0.354034
N  -6.016656 -0.290486 -1.891203
C  -0.155792 0.264676 1.396256
C  -1.268114 0.083612 0.337259
C  -2.672279 0.205369 0.974916
C  3.21352 0.660039 -0.219218
C  3.209636 -0.730125 0.053483
C  1.920331 1.242317 0.268132
C  1.913848 -1.078328 0.723391
C  -3.773285 0.03085 -0.082719
C  4.304573 1.27974 -0.845549
C  4.296779 -1.546376 -0.290927
C  5.410041 0.462168 -1.199469
C  5.406228 -0.92912 -0.926395
C  -6.553301 -0.108616 -0.715894
H  -0.233025 1.263832 1.861872
H  -0.248236 -0.507519 2.181221
H  -1.14508 0.848919 -0.452764
H  -1.156357 -0.908711 -0.140158
H  -2.772751 1.19537 1.462939
H  -2.78678 -0.56082 1.767367
H  -3.734322 0.803253 -0.866593
H  -3.741746 -0.956438 -0.569689
H  4.296393 2.354756 -1.050851
H  4.282734 -2.619091 -0.074193
H  6.279981 0.910466 -1.691224
H  6.273408 -1.534549 -1.211127
H  -8.62107 -0.195977 -1.062786
H  -8.186079 0.04753 0.614515
H  -6.691639 -0.449024 -2.663449
