program: Gaussian 09
title: 000203385
version: EM64L-G09RevD.01
frameworkgroup: C1[X(C23H24N2)]
method: RPBEPBE
basis: SDD
operation: Freq
keyword: #pfreq=noraman
keyword: PBEPBE/SDD
title: #p freq=noraman PBEPBE/SDD
converged: YES YES NO NO
title: Mulliken charges:
elementType: N N C C C C C C C C C C C C C C C C C C C C C C C H H H H H H H H H H H H H H H H H H H H H H H H
charge: -0.144019 -0.168591 -0.379691 -0.360432 -0.315424 -0.416919 -0.397811 0.448344 0.459777 0.472283 -0.436090 -0.448173 -0.364088 -0.350158 -0.375963 -0.379778 -0.225422 -0.224733 -0.244675 -0.242466 -0.236965 -0.229070 -0.244545 -0.244739 -0.269691 0.237966 0.193790 0.191822 0.235733 0.198172 0.215412 0.210429 0.215588 0.204388 0.226305 0.227523 0.256385 0.245647 0.231565 0.214975 0.223748 0.224338 0.224519 0.225030 0.217254 0.217803 0.227927 0.228119 0.224601
chargesum: 0.00000
title: Mulliken charges with hydrogens summed into heavy atoms:
elementType: N N C C C C C C C C C C C C C C C C C C C C C C C
charge: -0.144019 -0.168591 0.052065 0.067124 -0.117252 0.008922 0.022164 0.448344 0.459777 0.472283 -0.209786 -0.220650 -0.107703 -0.104512 -0.144398 -0.164802 -0.001674 -0.000394 -0.020156 -0.017436 -0.019711 -0.011268 -0.016618 -0.016621 -0.045089
polarizability: 3.18560214e+02 9.07429995e-01 2.66633413e+02 1.54959309e+01 1.01911012e+01 1.91660775e+02
1716.lowfreq: -6.9323 -0.0006 0.0005 0.0008 3.4217 6.5601 15.5512 23.3668 33.3052
frequency: 14.7741 23.1646 33.2700 47.0352 48.7770 66.9913 78.4246 86.1165 123.4382 171.2144 194.3629 204.3273 226.6109 245.0325 260.4103 269.8967 298.5277 335.1399 366.9729 402.6008 407.3603 408.9905 415.4672 433.2036 462.7932 481.1462 504.9556 514.2207 574.1768 605.6787 614.0946 615.0579 618.5460 630.0530 647.1322 689.6365 700.2163 712.1008 719.5690 755.2370 755.9911 760.9320 807.0943 818.7882 831.5886 847.6087 847.7565 852.6324 861.7781 872.1493 918.7437 921.6518 937.0541 955.2757 971.7404 976.2531 976.8479 977.5798 984.7088 989.9524 991.5265 994.9637 997.9234 1003.1714 1025.4780 1026.5829 1031.9210 1055.8300 1062.7379 1073.6915 1081.8636 1089.2641 1097.8892 1123.5532 1150.5341 1170.4433 1170.7186 1171.6314 1179.0663 1183.4525 1187.4312 1189.1243 1197.1613 1200.9579 1213.9176 1238.3982 1258.8938 1286.8272 1289.9749 1304.1141 1327.3242 1331.7430 1334.6426 1347.5506 1356.1678 1358.3435 1377.8426 1382.7669 1383.7612 1386.0513 1397.9096 1439.7885 1441.1287 1445.8292 1458.4504 1461.0334 1465.5830 1476.0365 1477.4106 1481.0501 1495.8811 1578.0884 1592.9596 1595.0315 1608.4300 1613.0888 1618.1850 2830.0105 2860.9390 2869.6018 2904.2008 2917.3511 3053.3795 3064.3442 3068.2989 3088.1143 3113.0302 3114.9330 3120.5295 3123.3794 3125.0053 3127.2186 3136.2999 3137.9459 3146.8743 3149.9843 3151.6241 3158.3683 3162.4649 3163.5311 3169.1199
redmass: 3.7257 4.5120 3.8987 4.7285 4.8184 4.0335 3.0322 4.3767 4.3363 4.0046 5.8510 4.1686 3.6841 2.1573 4.1595 4.0160 2.5764 3.9842 4.7958 2.8022 2.7615 2.8398 2.2173 3.6885 3.0379 3.1397 3.9613 2.8133 4.7634 5.4613 6.1830 5.6247 6.0786 3.0704 3.4211 1.7898 1.8484 1.7325 3.7636 1.7642 1.9033 2.3552 1.7706 2.2242 2.8709 1.9143 2.2596 1.3527 1.2611 1.5167 2.2878 1.8590 1.5539 1.3776 1.7473 1.5049 1.8196 2.8585 1.4240 5.9071 4.9964 1.3591 1.8986 1.6510 2.1114 2.2361 2.1418 1.8770 2.2226 1.5943 1.8172 1.6444 2.0687 2.5457 4.2488 1.0716 1.0816 1.0678 1.1992 1.4329 2.2653 1.7696 1.8891 1.1526 1.2918 1.4073 1.7016 1.4265 1.3085 1.3656 1.3823 1.3034 1.2887 1.4822 1.6738 1.4245 1.7760 3.7725 6.2656 3.0518 1.6970 2.1066 2.1507 2.4123 1.1131 1.0846 1.1183 1.1191 2.2361 2.2820 2.3391 5.9050 6.0296 6.2093 6.1630 6.1559 6.0538 1.0810 1.0717 1.0701 1.0695 1.0713 1.0906 1.0872 1.0890 1.0884 1.0872 1.0869 1.0844 1.0859 1.0863 1.0887 1.0911 1.0916 1.0956 1.0951 1.0917 1.0937 1.1014 1.1012 1.0995
irintensity: 0.1107 0.1832 0.3665 0.0155 0.1088 0.1265 1.1587 0.5333 0.5100 4.4702 0.2003 2.5217 2.1723 1.0166 0.8721 0.2225 11.7396 0.3176 0.5907 0.0596 2.3763 0.0924 1.1012 2.7191 0.6370 3.4134 9.1603 13.9012 14.4935 8.3116 0.3542 1.1714 4.0977 2.4600 12.4927 41.5213 25.3759 87.8758 1.9784 37.7354 75.4378 41.6923 4.2697 7.5187 2.6670 0.8370 0.7510 0.2383 0.4283 4.8660 21.3888 18.7995 25.0425 0.0647 2.5133 2.5482 5.2314 2.6453 1.9634 0.6755 1.4194 8.4819 59.7104 21.5300 11.6238 0.9036 12.4987 2.6536 8.4594 0.2976 13.0366 4.0849 11.0888 58.8917 34.5933 0.6697 0.1769 0.7731 2.9526 12.3642 3.7340 8.1295 0.0586 0.3926 1.8241 195.7748 2.1550 38.9454 4.0604 13.9166 1.2868 0.4909 4.7887 0.9419 33.3258 9.7694 31.0431 5.2488 0.8218 20.8757 2.8129 1.3891 24.7671 1.1884 2.7124 2.0545 70.9816 3.7396 27.1143 8.6408 144.8142 10.2740 0.0701 2.5636 11.7093 4.8449 186.3922 42.1221 42.0040 97.5960 62.8757 103.2030 23.6178 30.3635 15.0755 21.0654 7.4439 8.0078 10.0803 0.2955 0.1987 11.6711 10.5134 31.8820 10.0989 50.7047 42.4349 39.4650 35.0795 18.4162 5.1474
temp: 298.150 k
press: 1.00000 atm
elementType: 7 7 6 6 6 6 6 6 6 6 6 6 6 6 6 6 6 6 6 6 6 6 6 6 6 1 1 1 1 1 1 1 1 1 1 1 1 1 1 1 1 1 1 1 1 1 1 1 1
symmnumber: 1
zpe: 1076103.9 jmol-1
zpe.correction: 0.409866 hartree
zpe.thermalcorrener: 0.430925 hartree
zpe.thermalcorrenthalpy: 0.431870 hartree
zpe.thermalcorrgfe: 0.357167 hartree
zpe.sumelectzpe: -998.548035 hartree
zpe.sumelectthermal: -998.526976 hartree
zpe.sumelectthermalent: -998.526032 hartree
zpe.sumelectthermalfe: -998.600734 hartree
dipole: -1.9887 -0.1314 -0.3138
dipole: 2.0175
quadrupole: -154.6442 -135.7949 -143.4606
quadrupole: 0.3916 4.7517 2.3342
quadrupole: -10.0110 8.8383 1.1726 0.3916 4.7517 2.3342
hfenergy: -998.957901 hartree
pointgroup: C01 [X(C23H24N2)]
dipole: -0.7775477 -0.0768865 -0.1398761 debye
polarizability: 317.6759721|2.5803501|267.272634|18.1525833|8.5024596|191.9057961 unknown
InChI: InChI=1S/C23H24N2/c1-4-10-20(11-5-1)23(21-12-6-2-7-13-21)25-18-16-24(17-19-25)22-14-8-3-9-15-22/h1-15,23H,16-19H2
charge 0 multiplicity 1
49 atoms
N  -0.266556 -0.015467 -0.20092
N  2.646565 0.048737 -0.153832
C  0.490339 1.145359 -0.737891
C  0.529967 -1.243852 -0.456904
C  -1.654804 -0.087832 -0.751484
C  1.854816 1.288739 -0.044368
C  1.888004 -1.155338 0.256124
C  -2.459597 1.174509 -0.393787
C  -2.39887 -1.333127 -0.241695
C  4.050186 0.098724 0.040756
C  -3.382851 1.708292 -1.32463
C  -3.123883 -2.145594 -1.145705
C  -2.338503 1.788331 0.878666
C  -2.412032 -1.663495 1.137536
C  4.719237 1.321112 0.359989
C  4.858704 -1.070557 -0.116862
C  -4.178814 2.828195 -0.992268
C  -3.856667 -3.264013 -0.684981
C  -3.127526 2.910178 1.211937
C  -3.136273 -2.782519 1.600005
C  6.123393 1.36832 0.492744
C  6.258263 -1.011333 0.026809
C  -4.054685 3.432978 0.279355
C  -3.865651 -3.586045 0.690853
C  6.910873 0.207462 0.32952
H  -0.088621 2.068979 -0.571834
H  0.654387 1.034745 -1.839942
H  0.698094 -1.391528 -1.5539
H  -0.016308 -2.121098 -0.072862
H  -1.624902 -0.157689 -1.870648
H  2.399641 2.10997 -0.541492
H  1.694347 1.575241 1.02166
H  1.711861 -1.142336 1.356554
H  2.465047 -2.062417 0.020117
H  -3.482918 1.243783 -2.313922
H  -3.114981 -1.903789 -2.216091
H  -1.608317 1.387903 1.590763
H  -1.841412 -1.044479 1.838392
H  4.148447 2.238598 0.528104
H  4.400348 -2.029156 -0.378928
H  -4.889594 3.229377 -1.723665
H  -4.414053 -3.882818 -1.397313
H  -3.021217 3.377132 2.197945
H  -3.136294 -3.027881 2.668251
H  6.601318 2.323934 0.739419
H  6.845316 -1.92742 -0.109234
H  -4.669088 4.302433 0.539027
H  -4.431555 -4.452614 1.050882
H  7.999616 0.247867 0.437754
