program: Gaussian 09
title: 000203302
version: EM64L-G09RevD.01
frameworkgroup: C1[X(C15H20N2S)]
method: RPBEPBE
basis: SDD
operation: Freq
keyword: #p
keyword: freq=noraman
keyword: PBEPBE/SDD
title: #p freq=noraman PBEPBE/SDD
converged: YES YES NO NO
title: Mulliken charges:
elementType: S N N C C C C C C C C C C C C C C C H H H H H H H H H H H H H H H H H H H H
charge: 0.170983 -0.241366 -0.056911 -0.034666 0.541462 -0.170764 -0.693723 -0.698418 0.293851 -0.754107 -0.093197 -0.407737 -0.364805 -0.683670 -0.678932 -0.222097 -0.234959 -0.237363 0.234404 0.207412 0.272020 0.204863 0.218266 0.210016 0.258573 0.280031 0.193903 0.253706 0.247466 0.201072 0.224679 0.215134 0.208367 0.229719 0.215507 0.228834 0.230191 0.232255
chargesum: 0.00000
title: Mulliken charges with hydrogens summed into heavy atoms:
elementType: S N N C C C C C C C C C C C C C C C
charge: 0.170983 -0.241366 -0.056911 0.199738 0.541462 -0.170764 -0.009428 -0.011563 0.293851 -0.474075 0.100707 -0.154031 -0.117339 -0.042785 -0.025339 0.006737 -0.004768 -0.005108
polarizability: 2.89817523e+02 -2.75370721e+00 1.85065059e+02 -4.26599454e+00 -1.24820066e+01 1.29893823e+02
1716.lowfreq: -8.6734 -5.3613 0.0014 0.0019 0.0019 4.5895 30.1228 45.0637 48.3371
frequency: 30.0478 44.9864 48.2048 73.4082 74.8492 93.2388 109.4940 127.2813 182.0140 196.4018 207.7574 216.4931 231.9263 235.3954 249.0846 260.5072 291.2459 319.0516 361.4338 369.2159 407.1920 409.9903 417.4185 464.9544 478.7479 489.6361 550.1547 555.0303 603.5090 612.6074 637.7169 651.0129 703.8301 705.7399 747.1649 761.3618 790.3300 831.9568 855.2940 880.3210 909.1207 917.8606 923.6220 929.5734 942.2063 944.1102 966.6472 978.5578 988.3861 996.3965 1028.6900 1078.9219 1080.5776 1112.6319 1131.2126 1133.9687 1145.8633 1172.0459 1173.1088 1186.6572 1189.4270 1207.2538 1224.1244 1304.4071 1312.1362 1320.8313 1339.1934 1344.8743 1371.3640 1372.1477 1373.2627 1387.2224 1389.4737 1392.4989 1431.7933 1453.4211 1458.3934 1466.1849 1469.2945 1471.7702 1480.6814 1482.1855 1486.3352 1499.3170 1570.0718 1590.2826 1611.2777 1662.1307 2887.2701 2978.5356 2983.9028 2985.7298 2989.7769 3039.6117 3076.7700 3078.2343 3082.0105 3083.5440 3086.6015 3089.8311 3105.0930 3111.9250 3125.9439 3131.8019 3143.9953 3152.4147 3167.1560 3243.9091
redmass: 3.5122 3.3086 3.8455 3.8721 4.2867 2.8553 3.7717 4.5044 2.3366 1.9867 1.7124 1.0332 1.6912 1.9124 1.7299 1.6202 3.8994 4.2534 2.9348 3.6940 2.8925 3.0069 3.9834 3.8131 3.6264 3.1284 4.9678 4.6115 4.4219 6.6527 6.4193 5.5872 1.9257 1.3815 3.0033 2.7526 2.8522 3.2292 1.2526 2.9651 2.2843 1.2695 1.3830 1.3347 1.3960 1.4274 3.2767 1.4040 5.6454 1.3147 2.1084 1.7547 1.7540 1.8196 2.1918 2.0388 2.4106 2.0701 1.0655 1.6810 1.1395 2.4215 3.9383 1.3775 1.4270 1.3482 1.8708 1.6969 1.2159 1.3927 3.9440 1.3423 1.2154 1.3578 2.2932 1.0428 1.0478 1.0488 1.0505 1.0507 1.3952 1.5484 1.0505 1.0562 6.7044 7.3830 6.2141 10.6880 1.0823 1.0345 1.0352 1.0358 1.0362 1.0848 1.0996 1.1000 1.1009 1.0993 1.0997 1.1001 1.1001 1.0990 1.0847 1.0876 1.0924 1.0966 1.1017 1.0958
irintensity: 0.2291 0.1562 0.3738 2.5443 0.4043 0.1410 1.4802 0.2287 0.5477 0.9673 0.9374 0.0261 0.6718 0.2305 2.0905 5.7449 0.6009 0.2766 1.9736 7.5297 0.9002 2.7243 9.1569 1.0940 20.1555 11.5385 15.0053 0.7177 2.6357 0.9665 10.8117 2.9268 19.9451 79.0628 24.4348 42.9752 23.2399 23.4540 0.4545 4.1730 18.6019 5.1286 4.6546 1.2131 0.1326 0.8240 5.3553 0.3357 0.0794 0.1267 9.7266 7.1925 15.1391 13.0827 18.1511 47.9166 6.2464 56.5402 1.4900 26.1836 0.4517 3.2184 70.3671 11.9266 7.9631 3.5148 177.1079 6.2999 2.3190 47.9951 10.0164 17.8230 6.0278 53.6238 8.0224 1.2661 5.8965 0.4179 23.5032 7.9664 5.2397 17.4989 13.5748 6.1472 12.6996 5.4634 17.8053 659.8011 35.7528 27.5453 40.9560 34.4811 24.9611 5.9372 22.0025 13.9676 22.3279 47.0856 71.8074 44.1768 1.2621 18.9363 3.0389 0.6332 15.5518 31.0161 22.8520 5.5627
temp: 298.150 k
press: 1.00000 atm
elementType: 16 7 7 6 6 6 6 6 6 6 6 6 6 6 6 6 6 6 1 1 1 1 1 1 1 1 1 1 1 1 1 1 1 1 1 1 1 1
symmnumber: 1
zpe: 826748.6 jmol-1
zpe.correction: 0.314892 hartree
zpe.thermalcorrener: 0.333898 hartree
zpe.thermalcorrenthalpy: 0.334842 hartree
zpe.thermalcorrgfe: 0.267301 hartree
zpe.sumelectzpe: -1089.804795 hartree
zpe.sumelectthermal: -1089.785789 hartree
zpe.sumelectthermalent: -1089.784845 hartree
zpe.sumelectthermalfe: -1089.852386 hartree
dipole: -2.0930 0.8787 0.5011
dipole: 2.3246
quadrupole: -104.0774 -113.9055 -117.3112
quadrupole: -0.6899 -0.4733 -2.9703
quadrupole: 7.6873 -2.1408 -5.5465 -0.6899 -0.4733 -2.9703
hfenergy: -1090.1196868 hartree
pointgroup: C01 [X(C15H20N2S1)]
dipole: 0.8161934 -0.3977099 0.1100296 debye
polarizability: 289.6636102|-5.7943706|177.0170495|3.1772751|23.2489232|138.0957455 unknown
InChI: InChI=1S/C15H20N2S/c1-11(2)16-15-17(12(3)4)14(10-18-15)13-8-6-5-7-9-13/h5-12H,1-4H3
charge 0 multiplicity 1
38 atoms
S  -1.48995 2.335147 0.202817
N  -0.358598 -0.112383 0.000161
N  -2.75528 -0.218325 -0.182842
C  -0.168568 -1.598983 0.130482
C  0.707391 0.824347 0.127571
C  -1.654181 0.441091 -0.033759
C  -0.644373 -2.345403 -1.13477
C  -0.831447 -2.137809 1.418512
C  2.137872 0.432324 0.048762
C  0.301879 2.128924 0.256954
C  -4.072216 0.454612 -0.142961
C  3.057165 0.943742 1.004841
C  2.634977 -0.388328 -1.002799
C  -5.03657 -0.282735 -1.093771
C  -4.611761 0.481645 1.309243
C  4.434891 0.649355 0.910192
C  4.010674 -0.688103 -1.090735
C  4.917607 -0.171229 -0.135138
H  0.921934 -1.735516 0.230928
H  -0.414156 -3.422168 -1.037253
H  -1.731132 -2.220515 -1.265222
H  -0.136179 -1.963268 -2.03882
H  -0.451134 -1.606123 2.309171
H  -0.594562 -3.211607 1.529712
H  -1.92612 -2.02074 1.371665
H  0.945799 3.003885 0.289325
H  -3.969503 1.510297 -0.493481
H  2.680024 1.560699 1.827936
H  1.946625 -0.762369 -1.769021
H  -6.030128 0.201921 -1.095931
H  -4.642697 -0.284096 -2.125199
H  -5.156509 -1.332822 -0.771125
H  -5.597718 0.980653 1.346654
H  -3.920892 1.02582 1.977878
H  -4.726689 -0.549339 1.690542
H  5.128345 1.051468 1.657154
H  4.376586 -1.315279 -1.911227
H  5.985597 -0.404891 -0.205546
