program: Gaussian 09
title: 000203306
version: EM64L-G09RevD.01
frameworkgroup: C1[X(C18H24N2S)]
method: RPBEPBE
basis: SDD
operation: Freq
keyword: #p
keyword: freq=noraman
keyword: PBEPBE/SDD
title: #p freq=noraman PBEPBE/SDD
converged: YES YES NO NO
title: Mulliken charges:
elementType: S N N C C C C C C C C C C C C C C C C C C H H H H H H H H H H H H H H H H H H H H H H H H
charge: 0.117144 -0.351115 -0.032838 -0.035941 0.475036 0.171297 -0.891823 0.410289 -0.159496 -0.099683 -0.439157 -0.725929 -0.662495 -0.373945 -0.454081 -0.245067 -0.436475 -0.275346 -0.685700 -0.686618 -0.245292 0.221155 0.276928 0.320002 0.306996 0.193312 0.232598 0.233898 0.212083 0.226213 0.215123 0.212078 0.241138 0.298837 0.236225 0.224988 0.233747 0.223203 0.208976 0.229165 0.196258 0.221704 0.216719 0.222000 0.223888
chargesum: 0.00000
title: Mulliken charges with hydrogens summed into heavy atoms:
elementType: S N N C C C C C C C C C C C C C C C C C C
charge: 0.117144 -0.044120 -0.032838 0.185214 0.475036 0.171297 -0.294892 0.410289 -0.159496 0.093629 -0.206558 -0.053735 0.005843 -0.075108 -0.217856 -0.020079 -0.202728 -0.053346 -0.024357 -0.051937 -0.021404
polarizability: 3.01507349e+02 -1.52225496e+01 2.41150164e+02 -2.42160379e+00 -2.00325909e+01 1.69142243e+02
1716.lowfreq: -13.4001 -5.5798 -0.0015 0.0008 0.0017 4.4295 16.8727 26.7311 39.0491
frequency: 16.6858 26.6240 39.0342 48.5321 74.0582 81.7063 93.5077 110.3641 115.8673 126.2685 161.1945 179.3606 194.0112 207.3064 214.8312 239.1687 251.1237 265.3701 283.9537 308.8152 313.2139 354.4815 386.4990 405.3571 419.3282 425.2719 432.7561 456.3915 472.1252 484.9245 499.3598 503.0391 510.3366 539.5930 581.3460 622.9041 631.2798 681.2529 700.3563 752.1994 768.6636 785.8227 792.8987 810.3975 823.3129 845.8116 864.0677 890.1906 904.9068 911.0907 917.0227 921.5727 924.8377 941.1606 943.8545 953.8533 971.2726 985.8419 1010.6034 1021.8240 1044.5312 1079.6930 1096.3682 1132.1925 1135.9048 1145.5717 1149.1373 1163.4274 1167.4377 1176.1686 1184.0751 1186.1585 1202.9462 1234.8334 1239.9469 1258.0076 1290.8847 1291.7155 1311.5720 1325.9363 1345.9353 1376.2750 1377.2239 1381.0568 1392.8580 1393.5499 1407.2710 1422.2605 1445.9902 1450.5827 1455.3460 1457.3165 1464.5027 1466.4773 1468.8766 1471.2293 1475.4088 1479.3994 1486.6830 1487.4981 1519.8955 1588.1782 1597.5168 1633.6567 1661.0002 2920.9498 2974.4052 2977.1838 2978.5571 2980.4729 2982.3428 2994.9084 3072.4051 3076.9210 3080.2192 3081.8337 3083.6705 3084.2747 3087.5150 3089.9010 3096.1012 3106.6824 3116.6026 3117.9302 3125.2752 3132.9563 3153.5157 3154.9471 3492.0428
redmass: 4.2476 4.3663 4.4935 2.7024 3.4605 4.5483 3.7499 3.5380 3.7232 3.9711 4.4722 4.1622 3.3859 1.0369 1.0419 1.6743 1.1027 2.0775 2.9741 2.7446 2.9728 3.3122 2.6918 3.3540 3.7369 3.5872 2.9648 2.0148 3.2937 4.7568 1.9289 2.3968 5.0073 4.3726 5.3104 4.2769 5.3300 3.4142 5.0426 1.3334 3.2338 4.5708 1.7600 4.6127 1.8916 2.9289 3.6142 1.6485 1.8789 2.1685 1.2005 1.2576 1.5158 1.5863 1.5720 1.6635 1.3555 1.3906 1.3099 3.4495 2.4005 2.2399 1.6928 2.1074 2.1953 2.1904 1.3948 1.1831 1.9688 1.1559 1.2405 2.1301 3.0867 1.3674 1.4501 2.0718 1.3464 1.7280 1.4246 1.2670 1.3137 1.2147 1.2113 2.2223 1.2216 1.2151 2.8902 5.6265 2.1570 1.2863 2.4408 1.0508 1.0869 1.0512 1.0519 1.0595 1.1528 1.0795 1.0508 1.0543 3.4233 7.4327 5.2067 6.2934 7.8450 1.0813 1.0651 1.0372 1.0349 1.0365 1.0355 1.0822 1.0991 1.1002 1.1004 1.1001 1.1000 1.0996 1.0997 1.0994 1.0993 1.0910 1.0864 1.0872 1.0913 1.0939 1.0997 1.0995 1.0764
irintensity: 0.7673 0.2632 0.7548 0.1200 0.8796 1.6557 0.5556 2.3718 1.6842 0.4813 0.8541 1.8779 1.0541 0.0960 0.2524 1.8988 0.1046 1.0804 1.5466 4.5013 4.9641 5.8559 0.9446 9.4247 5.6772 6.5334 3.5945 14.5664 0.4258 11.3390 54.1879 40.1016 1.1184 10.8300 14.8513 13.7168 2.9578 4.8953 14.2698 1.0426 3.3738 8.2930 85.9671 37.5592 39.8273 17.6347 2.5739 1.2167 10.1262 8.6005 5.6205 5.0733 0.7486 0.4679 2.0331 2.8046 0.3695 4.0153 0.6836 8.5086 6.7181 5.0846 2.3695 10.3465 5.4590 17.3876 0.7640 11.3797 26.7574 6.3182 2.1270 20.3086 219.1014 2.7060 1.3612 5.1142 33.7425 5.0266 35.6488 8.9883 25.7482 12.9450 35.2329 13.3343 22.4539 36.7922 2.5767 0.6848 14.4538 194.2472 0.2693 4.5260 19.1207 2.7724 6.2822 5.0839 8.4591 33.4226 22.0194 2.3050 10.9663 2.0354 4.8954 1.3355 322.0996 65.8309 43.4371 25.5657 26.9288 19.9129 30.9731 17.9290 15.6582 11.0873 17.1427 32.4198 17.4796 109.6046 44.4236 13.1694 36.4605 30.3309 6.4557 3.6543 20.3478 14.8541 61.1377 26.7637 15.5283
temp: 298.150 k
press: 1.00000 atm
elementType: 16 7 7 6 6 6 6 6 6 6 6 6 6 6 6 6 6 6 6 6 6 1 1 1 1 1 1 1 1 1 1 1 1 1 1 1 1 1 1 1 1 1 1 1 1
symmnumber: 1
zpe: 991003.9 jmol-1
zpe.correction: 0.377453 hartree
zpe.thermalcorrener: 0.399621 hartree
zpe.thermalcorrenthalpy: 0.400565 hartree
zpe.thermalcorrgfe: 0.324924 hartree
zpe.sumelectzpe: -1206.318322 hartree
zpe.sumelectthermal: -1206.296155 hartree
zpe.sumelectthermalent: -1206.295210 hartree
zpe.sumelectthermalfe: -1206.370851 hartree
dipole: -3.4673 0.1704 -0.5496
dipole: 3.5147
quadrupole: -112.0569 -128.6117 -134.6212
quadrupole: -1.6851 3.2155 -3.8591
quadrupole: 13.0397 -3.5151 -9.5246 -1.6851 3.2155 -3.8591
hfenergy: -1206.6957755 hartree
pointgroup: C01 [X(C18H24N2S1)]
dipole: 1.3557036 0.0277279 -0.270905 debye
polarizability: 301.2143673|-13.3333333|215.3615567|-7.476305|40.3521099|195.2238308 unknown
InChI: InChI=1S/C18H24N2S/c1-13(2)19-18(20-14(3)4)21-12-16-10-7-9-15-8-5-6-11-17(15)16/h5-11,13-14,19H,12H2,1-4H3
charge 0 multiplicity 1
45 atoms
S  0.798253 1.934033 0.556746
N  3.354238 1.391459 -0.062971
N  2.010999 -0.538821 0.659311
C  4.413622 0.826494 -0.940874
C  -1.776981 0.901478 1.229233
C  -2.181434 0.014609 0.158451
C  -0.353036 0.949172 1.725277
C  -3.569762 0.007496 -0.262676
C  2.222926 0.708993 0.384743
C  3.038051 -1.603268 0.790477
C  -2.73674 1.727814 1.832725
C  5.484914 1.913709 -1.158302
C  3.83284 0.31589 -2.281325
C  -1.258733 -0.864942 -0.502293
C  -4.512392 0.873792 0.384403
C  -4.102929 1.718776 1.415657
C  -3.979081 -0.872809 -1.318897
C  -1.690816 -1.711784 -1.527214
C  3.960153 -1.326274 2.005534
C  2.30892 -2.953239 0.939079
C  -3.059726 -1.718437 -1.942113
H  4.889525 -0.023779 -0.414808
H  -0.290258 1.443657 2.70667
H  0.144559 -0.039276 1.765017
H  3.286734 2.414063 -0.053171
H  3.673825 -1.660947 -0.121987
H  -2.429918 2.399383 2.643978
H  5.909829 2.253371 -0.196708
H  5.056063 2.788816 -1.683877
H  6.307278 1.520244 -1.78005
H  3.417259 1.154599 -2.869369
H  4.620602 -0.175912 -2.881256
H  3.020459 -0.412363 -2.1092
H  -0.204782 -0.871748 -0.19884
H  -5.558843 0.859375 0.056332
H  -4.823411 2.378462 1.911548
H  -5.031626 -0.87107 -1.62784
H  3.358792 -1.287874 2.931996
H  4.711858 -2.130115 2.112488
H  4.487928 -0.361026 1.901728
H  3.032298 -3.785735 1.019857
H  1.65265 -3.13805 0.070167
H  1.676259 -2.944711 1.844891
H  -0.974761 -2.378554 -2.021462
H  -3.381604 -2.388351 -2.747476
