program: Gaussian 09
title: 000203268
version: EM64L-G09RevD.01
frameworkgroup: C1[X(C14H20N2O4)]
method: RPBEPBE
basis: SDD
operation: Freq
keyword: #p
keyword: freq=noraman
keyword: PBEPBE/SDD
title: #p freq=noraman PBEPBE/SDD
converged: YES YES NO NO
title: Mulliken charges:
elementType: O O O O N N C C C C C C C C C C C C C C H H H H H H H H H H H H H H H H H H H H
charge: -0.245639 -0.413938 -0.273310 -0.340387 -0.288582 -0.464806 -0.059578 -0.361750 -0.553248 -0.700316 -0.685173 0.214153 0.551052 -0.608153 -0.368815 0.090429 0.196901 -0.321521 0.231914 -0.496581 0.211434 0.193527 0.249761 0.233792 0.203426 0.264634 0.238050 0.195544 0.208421 0.198590 0.214572 0.229507 0.312544 0.250479 0.311250 0.267116 0.387771 0.245410 0.245307 0.236215
chargesum: 0.00000
title: Mulliken charges with hydrogens summed into heavy atoms:
elementType: O O O O N N C C C C C C C C C C C C C C
charge: -0.245639 -0.026167 -0.273310 -0.340387 -0.054790 -0.152262 0.151856 0.081538 -0.085189 -0.058300 -0.042504 0.214153 0.551052 -0.357674 -0.057565 0.090429 0.196901 -0.054405 0.231914 0.230350
polarizability: 3.26118807e+02 -3.85950415e+00 1.76487082e+02 1.05200286e+01 5.11965656e+00 1.07499486e+02
1716.lowfreq: -19.4488 -4.9099 -0.0016 -0.0012 0.0002 2.4433 12.5139 14.4263 29.8815
frequency: -9.2358 13.4183 29.8421 56.0366 65.1784 76.9742 86.3804 94.2824 106.9119 129.9991 150.6322 165.4383 172.2097 174.1315 209.3724 232.9401 246.4784 260.0882 292.1292 305.2217 316.9279 341.7047 361.7224 388.2858 429.4118 449.5435 456.3698 476.9883 516.6500 564.3787 575.5637 614.1402 634.0029 651.3355 672.3553 685.5305 714.4459 750.3063 763.8906 776.8221 796.9339 835.5372 855.4049 860.6431 875.5955 894.9641 911.1714 921.2724 930.2615 938.6310 974.8911 997.7314 1031.1090 1055.2375 1071.6380 1103.5522 1114.4397 1125.7617 1133.0763 1142.8483 1152.5815 1169.0695 1177.3117 1203.1955 1213.7680 1233.1656 1266.1470 1285.1425 1305.1520 1311.9958 1322.0322 1336.7159 1349.7335 1368.1753 1381.5305 1386.9876 1387.8884 1421.9107 1440.2279 1444.0949 1445.4305 1452.2458 1463.2589 1463.3994 1464.1804 1480.1632 1484.4046 1488.5879 1492.1582 1495.1962 1567.2665 1584.8310 1627.1479 1655.6403 2888.9388 2966.2600 2972.2124 2975.5368 2980.9692 2992.0718 3008.8776 3031.7070 3054.1078 3060.1914 3070.5823 3072.0099 3095.4909 3112.6116 3147.1532 3153.5613 3168.0049 3207.2450 3411.3626 3524.2187
redmass: 2.6825 5.1678 4.5376 4.5734 4.4790 3.0127 1.3380 2.5687 3.8748 4.4932 3.0535 3.4080 3.8027 4.4581 1.0516 3.0161 3.1487 1.4712 6.4260 4.0866 5.3099 6.0710 3.2130 2.7491 5.9866 2.3050 2.8520 3.4256 4.7121 6.5861 3.4848 3.1241 2.7067 2.5176 1.8468 2.6077 4.3543 3.4878 5.8970 3.2820 1.5241 2.2718 1.4071 1.1864 1.5915 5.6319 1.2444 2.4602 2.3876 1.9147 3.6804 1.3067 1.6639 4.2312 4.7620 2.0751 1.2583 1.9361 2.1136 1.5253 1.5447 1.9140 2.1912 1.6885 1.6816 1.8185 1.3172 2.2566 1.6025 1.6257 1.5409 1.3981 2.3294 1.2560 1.4416 1.4144 2.8219 1.8946 2.0300 1.1324 1.1455 1.0496 1.0544 1.0595 1.0494 1.0752 1.0532 1.0863 2.1587 2.9861 4.9396 4.2982 4.5179 5.1864 1.0710 1.0359 1.0442 1.0605 1.0775 1.0688 1.0295 1.0938 1.0940 1.0984 1.0971 1.0996 1.1001 1.1048 1.0919 1.1052 1.0907 1.0954 1.0736 1.0763
irintensity: 0.4995 0.1768 0.5205 0.0651 8.0161 0.2185 0.3352 2.2039 4.0133 3.4386 1.6327 3.2381 2.8660 3.2630 0.8506 7.0974 3.1808 3.8614 0.9654 2.1508 2.1761 30.4619 3.1830 1.0163 11.7790 5.3483 10.2711 7.1529 6.5451 2.8939 9.6389 3.8842 48.0867 48.2580 63.5701 1.5516 21.9830 0.2909 5.5793 1.0701 9.9271 7.2093 60.9048 158.7519 21.4045 18.4537 5.0117 1.4990 2.2140 1.8159 6.9050 1.2093 53.0954 16.1376 163.9004 45.3698 0.0531 29.6917 18.0380 20.7112 168.7853 104.9582 35.8551 172.3597 9.0743 85.8493 24.0610 357.4586 32.4634 2.7371 11.7466 10.1343 777.7839 47.7306 23.0569 25.3313 4.0377 280.0174 2.5606 18.5315 7.0162 14.6969 5.4166 14.2730 2.0055 8.7402 18.4827 4.7350 320.7661 100.3416 47.2883 216.7756 137.7676 373.8705 75.0554 26.5659 24.5614 23.2633 28.6653 337.8805 32.1050 5.4218 21.9113 6.8514 88.2122 50.9467 36.3558 24.0576 6.4324 13.9009 1.5943 7.1463 2.4296 13.5624
temp: 298.150 k
press: 1.00000 atm
elementType: 8 8 8 8 7 7 6 6 6 6 6 6 6 6 6 6 6 6 6 6 1 1 1 1 1 1 1 1 1 1 1 1 1 1 1 1 1 1 1 1
symmnumber: 1
zpe: 854089.4 jmol-1
zpe.correction: 0.325305 hartree
zpe.thermalcorrener: 0.345839 hartree
zpe.thermalcorrenthalpy: 0.346783 hartree
zpe.thermalcorrgfe: 0.274183 hartree
zpe.sumelectzpe: -954.389479 hartree
zpe.sumelectthermal: -954.368945 hartree
zpe.sumelectthermalent: -954.368001 hartree
zpe.sumelectthermalfe: -954.440601 hartree
dipole: -1.2225 0.2664 0.8952
dipole: 1.5385
quadrupole: -97.8820 -119.3797 -122.6130
quadrupole: -21.7203 -6.4312 -0.4678
quadrupole: 15.4096 -6.0881 -9.3214 -21.7203 -6.4312 -0.4678
hfenergy: -954.7147843 hartree
pointgroup: C01 [X(C14H20N2O4)]
dipole: -0.4868843 0.2389531 0.2687433 debye
polarizability: 325.1308222|-1.0653281|169.9607382|17.9805018|-21.0607797|115.0138147 unknown
InChI: InChI=1S/C14H20N2O4/c1-9(2)15-7-6-13(18)16-10-4-5-11(12(17)8-10)14(19)20-3/h4-5,8-9,15-17H,6-7H2,1-3H3
charge 0 multiplicity 1
40 atoms
O  -1.680914 -1.523277 -0.125598
O  3.841595 2.220258 -0.581662
O  5.325385 -1.566729 0.6551
O  5.783655 0.640189 0.082189
N  -5.553341 0.287889 -0.59062
N  -0.660958 0.539904 -0.606714
C  -6.782053 -0.415118 -0.130883
C  -4.271072 -0.198438 -0.042911
C  -3.097803 0.325824 -0.898498
C  -7.983845 0.110676 -0.941673
C  -7.047064 -0.305247 1.397056
C  -1.766084 -0.317594 -0.498069
C  0.712307 0.267824 -0.376287
C  1.620222 1.334514 -0.578503
C  1.185411 -1.015336 0.041883
C  3.492194 -0.140687 0.048715
C  3.002066 1.146224 -0.370714
C  2.558486 -1.195392 0.244764
C  4.932055 -0.302393 0.254239
C  6.781044 -1.755987 0.867965
H  -6.635789 -1.486219 -0.379534
H  -4.09507 0.073027 1.025699
H  -4.263623 -1.302151 -0.092089
H  -5.65531 1.309181 -0.490887
H  -3.042545 1.432094 -0.845101
H  -3.314013 0.06529 -1.953203
H  -7.79866 -0.007789 -2.023035
H  -8.156303 1.18595 -0.736095
H  -8.908214 -0.432918 -0.675819
H  -7.228404 0.748879 1.685018
H  -7.937339 -0.894488 1.68652
H  -6.189257 -0.681111 1.984081
H  -0.871594 1.494919 -0.907288
H  1.280954 2.325691 -0.898932
H  0.472845 -1.825629 0.195568
H  2.939389 -2.169834 0.563795
H  4.797357 1.911989 -0.387616
H  7.144382 -1.068129 1.649286
H  7.33056 -1.564836 -0.068602
H  6.880352 -2.804222 1.181558
