program: Gaussian 09
title: 000203246
version: EM64L-G09RevD.01
frameworkgroup: C1[X(C16H18N2O)]
method: RPBEPBE
basis: SDD
operation: Freq
keyword: #p
keyword: freq=noraman
keyword: PBEPBE/SDD
title: #p freq=noraman PBEPBE/SDD
converged: YES YES NO NO
title: Mulliken charges:
elementType: O N N C C C C C C C C C C C C C C C C H H H H H H H H H H H H H H H H H H
charge: -0.260027 -0.066373 -0.168459 -0.465201 -0.444650 -0.428707 -0.430158 -0.410118 -0.470634 0.324706 0.094558 0.104234 -0.452074 -0.022902 -0.383712 -0.363137 0.018577 -0.217425 -0.225609 0.222595 0.227589 0.229212 0.221960 0.223725 0.223893 0.244884 0.226662 0.241449 0.215435 0.252054 0.238621 0.278899 0.249845 0.240932 0.267467 0.229419 0.232469
chargesum: 0.00000
title: Mulliken charges with hydrogens summed into heavy atoms:
elementType: O N N C C C C C C C C C C C C C C C C
charge: -0.260027 -0.066373 -0.168459 -0.015017 0.006522 0.018911 0.041388 0.046766 0.020041 0.324706 0.094558 0.104234 0.076671 -0.022902 -0.142779 -0.095671 0.018577 0.011994 0.006860
polarizability: 2.33346152e+02 1.59955382e+01 1.56992814e+02 -2.10009856e+01 1.62166637e+01 1.62175638e+02
1716.lowfreq: -4.2820 -0.0001 0.0004 0.0006 2.7467 7.5500 16.0628 20.5704 34.4639
frequency: 15.2692 19.5832 33.9559 52.2908 77.8967 88.9776 111.6047 140.5375 150.6873 199.2644 218.9074 241.2699 253.3643 278.3608 294.9325 352.2589 368.1132 399.7313 414.0314 470.0016 481.3471 490.8623 563.1542 609.3679 634.7385 639.0150 659.0927 673.1472 734.2467 746.0592 755.5146 787.2571 791.2387 823.2639 830.0333 840.9570 875.0510 882.6312 906.5467 910.2911 932.7727 958.2326 967.2249 973.4231 996.6016 998.2977 1009.4203 1018.0818 1041.5207 1066.4114 1089.5851 1104.8354 1132.7704 1153.7926 1156.6691 1167.7515 1171.6218 1186.8967 1190.2317 1210.4332 1217.9767 1227.8827 1238.6943 1245.6776 1265.8715 1282.5349 1294.5015 1298.6934 1306.8115 1316.5055 1347.5578 1355.2032 1380.2039 1406.1763 1452.7686 1456.0741 1457.7251 1459.0644 1465.1882 1472.4412 1473.0452 1474.0040 1491.0789 1604.5247 1628.2353 1638.4290 2282.2399 2844.8850 2957.6442 2962.2918 2994.7395 3001.9801 3002.5492 3005.1069 3005.5622 3019.2448 3019.6419 3055.4982 3069.8716 3080.6773 3093.3420 3127.1436 3139.6698 3153.2181 3167.8437
redmass: 4.6936 4.8012 3.6475 4.1008 2.9864 1.9893 4.1713 4.0842 4.3425 3.5998 4.4680 2.6431 2.9921 4.1845 2.9968 3.5394 2.4533 4.6816 2.9763 4.9937 3.6850 4.7571 6.8439 4.0461 2.7258 2.8987 6.1429 4.7985 1.8844 5.2754 2.0548 2.4497 2.8926 4.3037 1.7535 2.1951 3.5131 1.3000 2.6579 3.1538 1.6908 1.4597 2.3968 1.8475 1.7492 1.3711 2.8768 2.0915 2.1150 2.2397 2.1662 2.5943 2.3677 2.0175 1.3471 1.1217 1.2832 1.2785 2.0377 1.5666 1.1618 3.1297 1.2491 1.3309 1.9561 1.3262 1.5327 1.2337 1.4092 1.2854 1.4097 1.3984 2.5222 6.2537 2.2082 1.0998 1.0929 2.1122 1.0815 1.2925 1.0930 1.0864 1.0932 7.2625 7.5666 11.5903 11.7406 1.0699 1.0619 1.0588 1.0628 1.0631 1.0669 1.1013 1.0819 1.0710 1.0898 1.1007 1.1022 1.1027 1.1042 1.0865 1.0900 1.0947 1.1001
irintensity: 0.1678 2.5191 0.4575 0.6205 1.8026 0.5543 1.0705 0.2313 3.8140 2.1969 3.0099 3.2413 16.0910 11.8767 4.3292 1.0081 4.0045 2.4071 1.8808 9.8395 5.9914 2.0931 1.8179 7.5482 4.8018 6.8584 4.0423 12.6562 54.8868 4.5379 20.0055 23.4241 8.3222 3.6732 5.4268 9.8097 14.8290 0.3517 0.6910 1.5797 13.9503 1.6531 10.7152 7.7178 0.7580 0.0236 28.2180 2.9611 19.4420 10.7934 16.4727 1.6175 33.3458 11.0488 3.5226 1.8800 4.7465 0.6442 2.8517 53.1470 3.2753 16.7626 11.9941 2.6666 146.7665 5.1810 7.3331 1.1118 5.9634 12.3876 19.7754 24.9121 62.4168 3.3822 5.7935 27.6034 1.5094 31.2104 3.5200 11.3537 8.3480 7.8520 11.0936 0.3153 17.5496 294.1106 0.8446 62.6231 31.6776 40.0067 43.5771 18.8753 64.1214 12.8042 22.2701 41.6507 9.6090 17.9946 8.0943 34.2388 75.9244 1.1377 10.8999 16.6420 26.0974
temp: 298.150 k
press: 1.00000 atm
elementType: 8 7 7 6 6 6 6 6 6 6 6 6 6 6 6 6 6 6 6 1 1 1 1 1 1 1 1 1 1 1 1 1 1 1 1 1 1
symmnumber: 1
zpe: 798994.5 jmol-1
zpe.correction: 0.304321 hartree
zpe.thermalcorrener: 0.321736 hartree
zpe.thermalcorrenthalpy: 0.322680 hartree
zpe.thermalcorrgfe: 0.255685 hartree
zpe.sumelectzpe: -803.780352 hartree
zpe.sumelectthermal: -803.762937 hartree
zpe.sumelectthermalent: -803.761993 hartree
zpe.sumelectthermalfe: -803.828988 hartree
dipole: 0.2645 -4.0424 -3.0997
dipole: 5.1009
quadrupole: -97.9566 -115.1805 -109.1042
quadrupole: 3.0403 5.9488 -2.7767
quadrupole: 9.4571 -7.7667 -1.6904 3.0403 5.9488 -2.7767
hfenergy: -804.084673 hartree
pointgroup: C01 [X(C16H18N2O1)]
dipole: 0.1173336 -0.3176011 -1.9780722 debye
polarizability: 234.0072129|25.0155527|142.6581255|-3.7743919|-1.438238|175.8492655 unknown
InChI: InChI=1S/C16H18N2O/c19-16-15-8-2-1-7-14(15)13-18(16)12-6-5-11-17-9-3-4-10-17/h1-2,7-8H,3-4,9-13H2
charge 0 multiplicity 1
37 atoms
O  -2.112464 0.387332 2.535529
N  4.408662 0.420804 0.088271
N  -1.443136 1.180639 0.399796
C  5.477357 -1.61381 -0.772052
C  4.490463 -2.026965 0.370946
C  5.652382 -0.067772 -0.581153
C  4.100878 -0.670111 1.062917
C  3.311397 0.656916 -0.903326
C  -1.837559 1.057315 -1.015471
C  -3.06091 0.156859 -0.936736
C  -3.29814 -0.18951 0.414918
C  -2.26181 0.452311 1.281138
C  -0.266158 1.930575 0.855282
C  2.0590 1.11642 -0.276776
C  -3.902143 -0.324885 -1.955506
C  -4.370767 -1.021618 0.787913
C  0.997909 1.477053 0.239405
C  -4.985775 -1.162579 -1.590036
C  -5.218904 -1.508497 -0.233356
H  6.443892 -2.142902 -0.704947
H  5.046446 -1.839396 -1.764505
H  3.601527 -2.540409 -0.03605
H  4.964149 -2.715388 1.092465
H  6.503869 0.132459 0.096318
H  5.834775 0.478005 -1.523181
H  3.044862 -0.619554 1.374186
H  4.726582 -0.510872 1.960586
H  3.670716 1.431174 -1.608468
H  3.074478 -0.250031 -1.51703
H  -1.019571 0.609745 -1.614905
H  -2.072556 2.048899 -1.453745
H  -0.231391 1.792929 1.954332
H  -0.406164 3.014409 0.663535
H  -3.732072 -0.065158 -3.006501
H  -4.529473 -1.274173 1.841377
H  -5.654863 -1.550063 -2.366581
H  -6.063891 -2.157947 0.020013
