program: Gaussian 09
title: 000203264
version: EM64L-G09RevD.01
frameworkgroup: C1[X(C16H22N2O4)]
method: RPBEPBE
basis: SDD
operation: Freq
keyword: #p
keyword: freq=noraman
keyword: PBEPBE/SDD
title: #p freq=noraman PBEPBE/SDD
converged: YES YES NO NO
title: Mulliken charges:
elementType: O O O O N N C C C C C C C C C C C C C C C C H H H H H H H H H H H H H H H H H H H H H H
charge: -0.250264 -0.385608 -0.304598 -0.225497 -0.426672 -0.455878 -0.007304 -0.444169 -0.396557 -0.398533 -0.399679 -0.390285 -0.515281 0.170647 0.564587 -0.667989 -0.383103 0.203069 0.135343 -0.283784 0.169863 -0.499801 0.196455 0.186600 0.203496 0.191113 0.220486 0.205110 0.197429 0.194091 0.208803 0.204178 0.193427 0.274145 0.249094 0.246188 0.359776 0.218129 0.307357 0.280052 0.351830 0.238599 0.226861 0.238275
chargesum: 0.00000
title: Mulliken charges with hydrogens summed into heavy atoms:
elementType: O O O O N N C C C C C C C C C C C C C C C C
charge: -0.250264 -0.033778 -0.304598 -0.225497 -0.152527 -0.096102 0.189151 -0.054073 0.015041 0.004005 0.003215 0.007320 -0.019999 0.170647 0.564587 -0.449860 -0.075746 0.203069 0.135343 -0.003732 0.169863 0.203934
polarizability: 3.01771592e+02 2.33751247e+01 2.02369449e+02 -1.89325083e+01 1.97463716e+01 1.43506751e+02
1716.lowfreq: -17.8803 -0.0007 -0.0006 -0.0005 2.4162 6.0491 13.8056 21.6259 26.4639
frequency: 10.4743 20.9706 25.0456 32.1498 50.8827 68.9360 90.6183 99.6190 118.4608 123.5412 163.6305 168.7261 191.0757 220.4387 229.8184 238.3647 271.3386 289.0954 300.6317 315.8040 335.0789 340.9664 386.5269 388.5916 421.1799 425.8951 449.3350 455.6060 495.9740 520.3833 529.9393 557.2235 564.5412 580.7216 628.4940 664.6111 679.1700 710.8426 748.4493 752.8188 777.1882 783.1751 798.6940 828.2135 840.6533 871.4267 875.0286 880.5530 890.7486 914.6593 918.8592 925.2792 938.5737 985.9211 992.9716 1001.7165 1035.3854 1039.1691 1051.7301 1058.6452 1092.6379 1108.6472 1111.6034 1113.9298 1130.1523 1141.9966 1145.3733 1164.0653 1177.1271 1184.4330 1209.5396 1237.1548 1237.5907 1250.2693 1255.4951 1258.1982 1291.2208 1301.4677 1310.1459 1312.1469 1322.4074 1333.7006 1337.5202 1340.7495 1345.2006 1368.0909 1378.6943 1414.2124 1423.1169 1441.1488 1447.8659 1449.6439 1456.6455 1462.3090 1465.3112 1465.6813 1469.0204 1476.0989 1508.0507 1516.3498 1588.3124 1619.6562 1630.2240 1636.9017 2868.6150 2958.6817 2970.2456 2971.0588 2972.0302 2974.2628 2982.0548 2997.9043 3017.6198 3032.9809 3036.3641 3038.6646 3044.6519 3048.9551 3096.2663 3103.0651 3139.3908 3179.1060 3199.0753 3230.8583 3448.4104 3547.9157
redmass: 4.0650 4.3196 4.4940 4.7119 4.4775 7.0784 4.4287 1.2003 3.3819 3.7808 4.2542 3.2938 3.7204 1.8148 3.8350 4.2748 5.1690 6.4159 3.6473 3.9540 2.2130 3.8080 5.9272 1.3224 2.6717 3.1404 2.1156 2.7380 4.3497 1.9167 3.6808 4.8539 4.7262 4.2771 6.8332 3.8962 3.1062 1.9807 5.8279 3.2212 2.2177 1.5437 4.1514 1.9477 2.4495 1.4740 4.3552 1.7073 1.4632 1.6041 2.3212 3.0262 2.0372 2.8715 2.6932 1.3253 7.0171 2.2775 1.5614 1.1979 1.4289 2.1084 2.4569 1.2633 3.6439 1.4409 2.4010 1.2777 2.0791 1.6051 1.5761 2.8489 1.3979 1.2714 1.2635 1.2324 1.6978 1.2171 1.3566 1.8666 1.4184 1.3745 1.4505 1.4893 1.4836 1.5660 3.9792 3.6285 1.2782 1.1107 1.2162 1.0504 1.0959 1.1117 1.0958 1.0528 1.0826 1.0975 2.1720 3.6530 5.4030 6.1552 9.3691 8.8862 1.0815 1.0591 1.0655 1.0647 1.0590 1.0635 1.0599 1.0297 1.0997 1.0982 1.0956 1.1024 1.1020 1.1035 1.1040 1.0910 1.1043 1.0894 1.0966 1.0768 1.0754 1.0657
irintensity: 0.0374 0.0730 2.6893 0.3706 2.3552 2.3599 1.8620 1.5214 2.5398 4.4381 5.6040 0.3710 4.6987 0.9407 3.7141 1.0755 6.4733 11.7065 10.8933 7.7369 1.1750 2.6817 27.5258 108.9926 2.1039 1.2701 0.4474 10.6770 4.1341 2.9956 13.4563 12.4009 8.9375 6.0093 0.8883 0.3798 25.0479 71.0505 9.9440 2.7997 3.5306 0.4250 2.8516 8.8189 8.5273 54.2232 14.5697 10.6252 6.4357 25.2623 3.1606 29.7034 62.3630 4.5559 10.8339 0.5327 306.5931 11.2798 2.9347 0.4378 0.1891 191.9098 12.0144 0.1109 67.8064 75.8486 7.0826 7.1804 45.3004 12.2328 22.8067 275.9267 57.6068 0.5120 2.3545 5.9868 26.4208 15.4638 4.7005 6.1284 14.9951 0.6595 0.6647 0.5540 12.4322 63.9239 124.4076 42.4050 51.0906 22.2483 5.4713 12.6981 4.1933 8.1699 6.0575 16.3325 21.4092 3.0575 346.2815 454.6185 27.7635 320.0453 316.2596 206.3866 72.9987 42.2195 31.2472 41.6210 61.8314 6.8282 28.5240 55.9279 58.4522 68.3293 26.1453 11.8245 10.1426 112.9085 31.2113 14.1137 18.8596 1.9068 2.8369 421.5587 0.2888 22.8546
temp: 298.150 k
press: 1.00000 atm
elementType: 8 8 8 8 7 7 6 6 6 6 6 6 6 6 6 6 6 6 6 6 6 6 1 1 1 1 1 1 1 1 1 1 1 1 1 1 1 1 1 1 1 1 1 1
symmnumber: 1
zpe: 950210.8 jmol-1
zpe.correction: 0.361916 hartree
zpe.thermalcorrener: 0.383809 hartree
zpe.thermalcorrenthalpy: 0.384753 hartree
zpe.thermalcorrgfe: 0.307459 hartree
zpe.sumelectzpe: -1031.649048 hartree
zpe.sumelectthermal: -1031.627156 hartree
zpe.sumelectthermalent: -1031.626212 hartree
zpe.sumelectthermalfe: -1031.703505 hartree
dipole: 6.9028 -1.2684 -1.6689
dipole: 7.2141
quadrupole: -115.4671 -142.3192 -126.0208
quadrupole: -11.4415 -12.0370 -2.7040
quadrupole: 12.4686 -14.3836 1.9149 -11.4415 -12.0370 -2.7040
hfenergy: -1032.0109645 hartree
pointgroup: C01 [X(C16H22N2O4)]
dipole: -2.7556104 -0.3257905 -0.5967028 debye
polarizability: 300.43284|26.130635|140.0408292|-16.9784801|-15.3066345|207.1741233 unknown
InChI: InChI=1S/C16H22N2O4/c1-22-16(21)13-8-7-12(9-14(13)19)18-15(20)10-17-11-5-3-2-4-6-11/h7-9,11,17-19H,2-6,10H2,1H3
charge 0 multiplicity 1
44 atoms
O  -0.867829 -1.296212 3.149835
O  2.305796 -0.137084 -2.720408
O  5.284318 0.365359 0.338335
O  4.906879 0.418019 -1.958489
N  -3.525641 -1.573113 0.576215
N  -0.909537 -1.136484 0.783498
C  -4.46638 -0.426203 0.3931
C  -5.176537 -0.555365 -0.973618
C  -3.739392 0.935601 0.494154
C  -6.173258 0.607368 -1.197416
C  -4.734534 2.104061 0.291864
C  -5.475411 1.982094 -1.061148
C  -2.95867 -1.747148 1.935831
C  -1.462411 -1.357532 2.033819
C  0.414335 -0.796959 0.437326
C  0.715794 -0.6324 -0.938282
C  1.442729 -0.617879 1.404948
C  2.021205 -0.295157 -1.361637
C  3.06726 -0.111409 -0.40489
C  2.732408 -0.28266 0.968231
C  4.454193 0.240351 -0.803207
C  6.690344 0.709156 0.04528
H  -5.252839 -0.447066 1.18905
H  -5.707947 -1.528011 -1.034381
H  -4.408393 -0.551367 -1.773785
H  -2.95251 0.976997 -0.286368
H  -3.230742 1.034914 1.472265
H  -6.642232 0.51176 -2.195238
H  -6.99144 0.536069 -0.451568
H  -5.475522 2.103133 1.117954
H  -4.194994 3.068194 0.349658
H  -6.21751 2.796559 -1.165993
H  -4.745235 2.104566 -1.887522
H  -3.946047 -2.441688 0.220794
H  -3.027141 -2.804125 2.256775
H  -3.500649 -1.153214 2.698225
H  -1.645798 -1.228516 0.052063
H  -0.075757 -0.77366 -1.687527
H  1.211874 -0.743658 2.463779
H  3.531019 -0.142629 1.700458
H  1.492164 -0.299259 -3.263071
H  6.750364 1.673142 -0.488512
H  7.175729 0.771228 1.030034
H  7.157648 -0.072079 -0.578633
