program: Gaussian 09
title: 000203234
version: EM64L-G09RevD.01
frameworkgroup: C1[X(C15H20N2O)]
method: RPBEPBE
basis: SDD
operation: Freq
keyword: #p
keyword: freq=noraman
keyword: PBEPBE/SDD
title: #p freq=noraman PBEPBE/SDD
converged: YES YES NO NO
title: Mulliken charges:
elementType: O N N C C C C C C C C C C C C C C C H H H H H H H H H H H H H H H H H H H H
charge: -0.253399 -0.189683 -0.279404 -0.376839 -0.376682 -0.457677 -0.457033 0.434610 -0.372988 -0.436754 0.368467 -0.521761 0.371653 0.152671 -0.581513 -0.404747 -0.368575 -0.836534 0.228350 0.213462 0.226924 0.217636 0.224717 0.227294 0.222732 0.227989 0.239566 0.211180 0.229796 0.223263 0.249538 0.237909 0.238896 0.234468 0.219800 0.286623 0.213281 0.212765
chargesum: 0.00000
title: Mulliken charges with hydrogens summed into heavy atoms:
elementType: O N N C C C C C C C C C C C C C C C
charge: -0.253399 -0.189683 -0.279404 0.064973 0.067878 -0.005666 -0.006312 0.434610 0.077757 0.016305 0.368467 -0.034314 0.371653 0.152671 -0.342617 -0.170279 -0.148776 -0.123865
polarizability: 2.74243522e+02 2.33338482e+00 1.64889697e+02 9.76197482e-01 -1.36943168e+00 1.18239157e+02
1716.lowfreq: -10.7791 -6.0242 -0.0007 -0.0003 0.0000 4.6313 30.9130 47.5720 69.3700
frequency: 30.7483 47.5338 69.3691 77.6736 95.1176 127.3066 152.9038 162.0260 164.9538 194.2636 203.1360 215.5257 236.3411 245.6451 300.9131 354.1694 381.4054 422.2182 450.2329 506.4743 514.0252 548.4399 572.6549 582.9453 586.4964 620.5434 657.6202 701.4886 725.8678 736.5792 797.1100 832.2480 843.9741 852.2747 864.8397 876.2964 892.6509 915.3951 919.2191 924.0010 926.9699 939.9485 973.8551 985.9438 1024.4478 1029.9103 1049.7076 1064.3244 1069.6447 1084.1718 1122.2758 1145.2235 1150.8781 1159.5242 1166.0340 1184.1998 1192.2285 1200.5402 1212.5462 1220.2386 1222.5225 1241.5025 1276.7326 1285.0198 1299.9774 1304.7809 1311.3629 1316.0745 1324.6302 1343.4944 1365.0986 1383.0071 1395.7609 1398.9037 1436.7016 1452.4125 1454.9353 1468.1540 1473.9520 1476.5241 1484.6495 1494.5472 1497.0796 1503.1246 1518.1051 1566.4782 1632.3271 1635.5639 2926.5104 2931.6713 2959.3815 2976.3093 2993.7077 2994.2127 3006.6205 3013.5732 3015.0178 3017.3542 3054.4442 3058.9818 3075.6939 3079.4574 3084.3470 3088.9678 3093.2980 3127.5361 3142.8848 3160.1214
redmass: 4.1296 3.4725 3.4767 3.3227 3.3360 3.4525 2.4702 1.2389 2.1736 2.5048 3.2458 3.6905 3.0531 1.8945 3.0768 5.4307 5.4723 4.5202 3.0623 4.5737 3.3599 3.4300 2.0775 3.2758 3.0957 3.2532 5.6262 3.2470 3.4890 3.1405 1.5156 2.0834 1.7620 1.7171 1.8350 2.2072 1.5257 2.5591 4.3084 1.3912 1.4674 2.2494 2.0495 1.6291 1.9955 1.9937 1.5331 1.7886 1.7247 3.3909 1.5921 1.6977 1.3914 1.4739 1.4620 2.8527 1.5339 1.9221 2.9734 1.3401 1.2844 1.3091 1.3493 1.5036 1.8094 1.3590 1.2322 1.3680 1.5766 1.4269 2.2549 3.5673 1.2480 4.7239 3.2306 1.0821 1.0675 1.0883 1.0988 1.0936 1.2829 1.1043 1.0964 1.1779 2.4544 7.4090 6.7952 9.2490 1.0642 1.0669 1.0673 1.0362 1.0894 1.0907 1.0647 1.0663 1.0725 1.0638 1.0952 1.0970 1.1005 1.0994 1.0999 1.1052 1.1027 1.0877 1.0899 1.0947
irintensity: 2.1938 2.4016 0.9774 0.6284 2.4335 0.4289 2.2813 0.5397 3.8991 1.2288 7.6925 0.8322 1.1428 0.2460 3.1841 2.6225 3.1532 1.4166 5.4697 3.7798 2.6719 1.0966 0.8487 1.2197 6.8971 8.1061 7.8610 3.0714 2.2271 0.8665 36.5942 15.3360 8.9990 23.3894 0.2518 8.7678 2.5507 7.1456 1.7877 0.3804 0.2710 6.0657 0.3826 4.0327 14.9706 20.8635 8.9798 1.7848 0.3661 18.1197 1.8657 3.6691 10.6700 7.8027 0.1241 24.0030 21.9583 3.8534 64.7799 7.2553 11.8891 12.1033 1.7290 81.0390 79.4293 3.0853 0.3023 5.2876 10.0557 8.2011 139.8246 19.7203 20.9220 18.8862 49.6672 10.3960 23.3355 8.6752 38.2005 17.4362 5.8540 14.7173 6.0230 132.6257 232.6350 21.8881 188.7786 306.1922 121.3150 32.0895 53.1782 28.5518 10.2926 18.8440 22.6591 82.5118 41.6478 33.1734 26.5963 16.8288 44.2277 22.9653 19.9779 57.0014 34.8492 21.5334 18.5052 17.8314
temp: 298.150 k
press: 1.00000 atm
elementType: 8 7 7 6 6 6 6 6 6 6 6 6 6 6 6 6 6 6 1 1 1 1 1 1 1 1 1 1 1 1 1 1 1 1 1 1 1 1
symmnumber: 1
zpe: 847367.3 jmol-1
zpe.correction: 0.322745 hartree
zpe.thermalcorrener: 0.339585 hartree
zpe.thermalcorrenthalpy: 0.340529 hartree
zpe.thermalcorrgfe: 0.277659 hartree
zpe.sumelectzpe: -766.994461 hartree
zpe.sumelectthermal: -766.977621 hartree
zpe.sumelectthermalent: -766.976677 hartree
zpe.sumelectthermalfe: -767.039547 hartree
dipole: -2.4853 -2.6471 -2.8183
dipole: 4.5964
quadrupole: -81.8541 -103.0703 -114.2884
quadrupole: -9.5549 -9.5100 -5.7216
quadrupole: 17.8835 -3.3327 -14.5508 -9.5549 -9.5100 -5.7216
hfenergy: -767.3172058 hartree
pointgroup: C01 [X(C15H20N2O1)]
dipole: -0.933865 0.0191525 -1.548443 debye
polarizability: 273.6398157|6.7108227|142.7374415|5.1885877|23.6527288|140.9951192 unknown
InChI: InChI=1S/C15H20N2O/c1-12-11-13(16-8-2-3-9-16)6-7-14(12)17-10-4-5-15(17)18/h6-7,11H,2-5,8-10H2,1H3
charge 0 multiplicity 1
38 atoms
O  3.055203 0.09985 2.206753
N  -3.103114 -0.033217 -0.10704
N  2.59125 0.166445 -0.12278
C  -3.879825 -1.140193 -0.702672
C  -3.963453 0.9855 0.529304
C  -5.312436 -0.915477 -0.161685
C  -5.385043 0.620334 0.039181
C  -1.712231 0.021268 -0.111671
C  3.345439 0.025699 -1.395893
C  4.791587 0.430935 -1.004602
C  1.151101 0.140265 -0.095039
C  4.880871 0.059687 0.495459
C  0.400408 1.141157 0.590609
C  3.427534 0.118162 1.000141
C  -1.009491 1.056892 0.577723
C  -0.936669 -0.952823 -0.814502
C  0.465936 -0.886805 -0.789828
C  1.078607 2.285623 1.316995
H  -3.47288 -2.123644 -0.395317
H  -3.854514 -1.0995 -1.813894
H  -3.669742 2.007586 0.219305
H  -3.89144 0.938699 1.638219
H  -5.432227 -1.42996 0.809411
H  -6.085159 -1.297047 -0.850208
H  -5.590331 1.119818 -0.925585
H  -6.165888 0.924716 0.756322
H  2.906572 0.674688 -2.1731
H  3.308996 -1.021101 -1.762845
H  4.919993 1.520373 -1.132703
H  5.546059 -0.07858 -1.626955
H  5.515933 0.735413 1.090812
H  5.258069 -0.969366 0.650658
H  -1.572986 1.820582 1.12383
H  -1.427069 -1.7555 -1.37309
H  1.043191 -1.656632 -1.315273
H  1.54757 1.924716 2.250335
H  1.889637 2.722606 0.704513
H  0.356739 3.083628 1.561308
