program: Gaussian 09
title: 000203307
version: EM64L-G09RevD.01
frameworkgroup: C1[X(C12H19O6PS)]
method: RPBEPBE
basis: SDD
operation: Freq
keyword: #p
keyword: freq=noraman
keyword: PBEPBE/SDD
title: #p freq=noraman PBEPBE/SDD
converged: YES YES NO NO
title: Mulliken charges:
elementType: S P O O O O O O C C C C C C C C C C C C H H H H H H H H H H H H H H H H H H H
charge: 0.911283 1.399420 -0.546933 -0.507517 -0.502855 -0.554612 -0.549787 -0.603434 -0.305387 0.517159 0.401759 -0.511015 -0.210389 -0.395045 -0.827472 -0.743643 -0.255045 -0.216523 -0.647017 -0.656206 0.308277 0.309231 0.267273 0.245224 0.227627 0.292562 0.266559 0.295328 0.266962 0.239217 0.231634 0.240157 0.231494 0.218493 0.231922 0.245138 0.212076 0.234544 0.239541
chargesum: 0.00000
title: Mulliken charges with hydrogens summed into heavy atoms:
elementType: S P O O O O O O C C C C C C C C C C C C
charge: 0.911283 1.399420 -0.546933 -0.507517 -0.502855 -0.554612 -0.549787 -0.603434 -0.305387 0.517159 0.401759 -0.202738 0.098842 -0.127772 -0.062059 0.085207 0.215807 0.255127 0.048536 0.029955
polarizability: 2.72975248e+02 -1.46008272e+01 1.77505068e+02 1.34067378e+00 1.74296190e+01 1.66730893e+02
1716.lowfreq: -25.4918 -6.6206 -0.0008 0.0004 0.0018 0.5165 7.1403 14.3754 23.4994
frequency: -25.4114 13.7933 22.6163 35.4754 45.1352 50.8037 58.7721 66.5161 75.7684 95.9696 113.7262 139.1605 150.0476 164.3839 168.9669 188.0124 200.0825 207.1505 230.3990 234.7741 237.8617 256.3908 268.2723 284.9724 290.6803 310.5439 341.5842 372.0232 377.9961 389.3887 413.9530 445.2215 455.9003 469.3625 527.5714 544.9268 573.9707 596.0372 606.0155 663.9826 702.5844 717.0897 762.4102 785.8665 798.6350 811.7796 844.8092 856.3407 880.1191 881.2738 908.6461 929.8519 966.7457 978.7076 996.3349 1002.4174 1005.5158 1012.3800 1019.8818 1051.9317 1056.6490 1092.7983 1107.0254 1127.2380 1130.5177 1140.6516 1161.8946 1224.0727 1250.7596 1271.2147 1283.2636 1301.4496 1353.9331 1354.3720 1374.9013 1390.6490 1391.4881 1396.3608 1403.2314 1408.7396 1421.4664 1456.1483 1456.6883 1459.1136 1461.4610 1475.2240 1478.1776 1478.4142 1487.5866 1490.6241 1578.6961 1598.9905 2974.5411 2987.9001 2997.3361 3009.6968 3018.6241 3030.5267 3061.5874 3076.9856 3080.7620 3088.8974 3094.3966 3102.5112 3112.0335 3116.6622 3142.6209 3146.0827 3177.8842 3180.4839 3184.6006
redmass: 2.7296 4.4309 4.2511 3.0866 2.8682 2.7480 3.1507 4.2461 2.2071 1.5550 4.2732 1.2036 3.9079 2.8203 4.4649 3.5359 3.5598 3.6019 1.8003 3.9973 1.5210 3.4197 4.0065 4.8814 5.4451 6.7890 7.7090 6.2878 4.2095 7.0580 4.5487 5.9870 3.2450 4.6356 5.8914 5.5723 7.0688 5.2620 6.2470 7.9749 5.8867 3.5671 8.1856 12.6129 1.1218 1.0876 1.3766 3.8422 3.4949 4.8470 1.3778 3.1796 1.4647 1.3693 4.1138 1.8061 2.5170 2.3708 1.6591 1.9874 4.3962 2.2208 2.2954 1.3679 1.3966 1.5469 1.7766 3.6746 1.1554 1.1160 1.4210 1.1425 1.2479 1.2172 7.1935 1.9757 1.6653 1.2442 1.1871 1.0803 1.0645 1.9707 1.0450 1.0636 1.0705 1.1832 1.0684 1.0585 1.0853 1.0841 5.9227 7.3547 1.0411 1.0359 1.0362 1.0572 1.0608 1.0247 1.0926 1.1080 1.1007 1.0998 1.0976 1.1003 1.1055 1.1032 1.0904 1.0929 1.1068 1.0955 1.1076
irintensity: 0.7348 0.3891 2.4950 1.5655 4.1749 2.7038 2.9600 1.9649 1.3345 1.2208 1.9459 0.5713 4.2924 1.5372 4.0592 0.2937 7.5207 0.9756 3.5982 1.0747 2.4123 11.5814 13.1689 5.3135 13.9784 7.5447 18.8379 24.2878 10.4367 10.9698 30.5315 80.7791 24.0052 9.5398 5.9629 32.0850 41.9500 41.7406 48.6852 111.1027 109.6597 1.8138 155.7346 58.9978 3.4555 2.7895 27.9555 130.5477 55.0823 262.3702 38.3248 126.2418 81.7340 3.8592 17.5573 53.6348 154.8328 120.2385 12.8816 24.5305 90.0552 9.3923 16.2075 7.1768 4.6359 11.0933 79.2090 204.4015 0.3562 0.1712 12.2279 5.9844 3.0421 10.5022 2.2654 12.4131 48.9761 24.7271 16.0032 9.4039 24.1639 21.4217 12.8047 15.6039 4.7944 30.5902 25.6151 12.0936 13.1984 50.8617 85.8724 47.1925 18.1876 11.3097 18.0318 20.9397 30.3058 1.4805 17.1641 6.3490 19.3881 18.6971 22.8213 2.5701 26.6906 34.0338 9.9409 0.0488 0.5070 4.4488 1.6552
temp: 298.150 k
press: 1.00000 atm
elementType: 16 15 8 8 8 8 8 8 6 6 6 6 6 6 6 6 6 6 6 6 1 1 1 1 1 1 1 1 1 1 1 1 1 1 1 1 1 1 1
symmnumber: 1
zpe: 779064.8 jmol-1
zpe.correction: 0.296730 hartree
zpe.thermalcorrener: 0.320720 hartree
zpe.thermalcorrenthalpy: 0.321665 hartree
zpe.thermalcorrgfe: 0.240319 hartree
zpe.sumelectzpe: -1657.570017 hartree
zpe.sumelectthermal: -1657.546027 hartree
zpe.sumelectthermalent: -1657.545083 hartree
zpe.sumelectthermalfe: -1657.626428 hartree
dipole: 4.7695 4.1843 -4.2210
dipole: 7.6206
quadrupole: -149.6824 -125.5967 -140.6251
quadrupole: -27.4465 -6.3588 -3.7131
quadrupole: -11.0477 13.0380 -1.9904 -27.4465 -6.3588 -3.7131
hfenergy: -1657.8667473 hartree
pointgroup: C01 [X(C12H19O6P1S1)]
dipole: 2.1104708 1.5093922 -1.502228 debye
polarizability: 269.5602323|-21.9209274|180.0381891|11.2386208|15.4287066|167.6127874 unknown
InChI: InChI=1S/C12H19O6PS/c1-5-16-19(13,17-6-2)18-11-7-8-12(10(3)9-11)20(4,14)15/h7-9H,5-6H2,1-4H3
charge 0 multiplicity 1
39 atoms
S  -4.269819 -0.072825 -0.754099
P  2.908648 0.234367 0.498109
O  1.691367 -0.947345 0.056585
O  3.23833 0.962111 -1.034818
O  4.200492 -0.828814 0.791232
O  -4.605712 -1.13651 -1.954164
O  -5.09735 -0.125213 0.657939
O  2.585835 1.23465 1.683323
C  -2.388851 -0.208451 -0.439234
C  -1.750455 0.479509 0.620945
C  0.319666 -0.636831 -0.104994
C  -0.359691 0.239769 0.772905
C  -1.733049 -1.099523 -1.307263
C  -0.351151 -1.31381 -1.146526
C  -2.461618 1.42906 1.568654
C  -4.532008 1.673203 -1.495623
C  3.267919 2.460531 -1.125477
C  4.627159 -1.830297 -0.248428
C  1.869124 3.019841 -1.384365
C  5.858742 -2.516769 0.329159
H  0.187277 0.728525 1.58687
H  -2.311699 -1.615487 -2.081635
H  0.204619 -1.992793 -1.798201
H  -1.891671 1.537148 2.505689
H  -2.548616 2.440421 1.124426
H  -3.478349 1.073193 1.807115
H  -3.904283 1.736116 -2.394926
H  -5.604166 1.710553 -1.734675
H  -4.256067 2.405041 -0.724697
H  3.706266 2.875415 -0.199329
H  3.950677 2.640573 -1.971891
H  3.790349 -2.532273 -0.410391
H  4.846949 -1.288783 -1.186816
H  1.930078 4.111806 -1.551127
H  1.422269 2.555776 -2.280238
H  1.206062 2.842033 -0.519552
H  6.223112 -3.282814 -0.380384
H  6.667585 -1.788418 0.506156
H  5.616131 -3.011686 1.284246
