program: Gaussian 09
title: 000203194
version: EM64L-G09RevD.01
frameworkgroup: C1[X(C19H29N3O5)]
method: RPBEPBE
basis: SDD
operation: Freq
keyword: #p
keyword: freq=noraman
keyword: PBEPBE/SDD
title: #p freq=noraman PBEPBE/SDD
converged: YES YES NO NO
title: Mulliken charges:
elementType: O O O O O N N N C C C C C C C C C C C C C C C C C C C H H H H H H H H H H H H H H H H H H H H H H H H H H H H H
charge: -0.239670 -0.297399 -0.239826 -0.384248 -0.227792 -0.173479 -0.109927 -0.452646 -0.346706 -0.350213 -0.314113 -0.310485 -0.455374 0.145837 -0.370163 -0.327095 -0.337515 -0.303196 0.570722 -0.671884 -0.670095 0.115692 -0.672660 -0.383693 0.205897 -0.290725 0.182363 0.209939 0.219611 0.216621 0.231265 0.188653 0.224689 0.228073 0.184097 0.245484 0.239305 0.235949 0.213464 0.205704 0.189488 0.231748 0.189703 0.229167 0.236210 0.351282 0.205487 0.227236 0.209731 0.204667 0.225712 0.207379 0.216609 0.307506 0.280999 0.352614
chargesum: 0.00000
title: Mulliken charges with hydrogens summed into heavy atoms:
elementType: O O O O O N N N C C C C C C C C C C C C C C C C C C C
charge: -0.239670 -0.297399 -0.239826 -0.031634 -0.227792 -0.173479 -0.109927 -0.101364 0.082844 0.097673 0.099229 0.101685 0.029415 0.145837 0.079250 0.068097 0.083936 0.162181 0.570722 -0.029429 -0.032337 0.115692 -0.456051 -0.076187 0.205897 -0.009726 0.182363
polarizability: 3.84508118e+02 1.90585374e+01 2.49518322e+02 1.39417010e+01 -9.36671007e+00 1.69226573e+02
1716.lowfreq: -14.2956 -10.1169 -8.3508 -0.0015 -0.0009 0.0008 3.3197 7.7764 17.4358
frequency: -9.6080 -1.9163 17.4280 27.8818 31.0871 37.3592 44.8367 62.5195 67.9886 77.3792 83.0305 84.5360 96.4215 129.9036 136.6475 167.9107 192.5457 203.7024 225.9213 233.1093 242.3313 256.1717 266.5417 282.7950 291.4387 303.2201 317.1202 319.9989 326.0062 339.3312 378.5311 382.6996 392.0926 403.2060 410.8505 449.9405 453.5905 468.1770 483.3152 498.9495 512.2699 559.9809 562.0164 579.4230 618.7954 628.8999 673.9886 676.9671 735.1736 747.0525 751.3702 765.0185 793.1796 794.6369 796.3808 806.0525 811.7869 821.9278 837.6772 870.9061 879.7187 884.9808 901.5193 912.8996 924.0924 976.5221 988.0288 989.9842 1000.9209 1002.7451 1013.6324 1025.0656 1051.9797 1053.5565 1067.1414 1076.2819 1079.9984 1083.8814 1084.7005 1102.4948 1108.1850 1125.4680 1125.7953 1132.2668 1163.8600 1178.1943 1180.0235 1191.4432 1206.9888 1207.7192 1215.8740 1231.7764 1250.1288 1266.2096 1276.2050 1280.5167 1290.5388 1291.4926 1293.4824 1296.5226 1310.4610 1313.3723 1327.4350 1336.8435 1353.2603 1363.4180 1369.5238 1370.1894 1373.0758 1379.2226 1381.3571 1386.6965 1387.3892 1413.9074 1442.8554 1443.8221 1446.2345 1449.9642 1453.8887 1461.8385 1462.3016 1463.5193 1472.2172 1480.1731 1484.3165 1487.6015 1491.1698 1506.5166 1514.1898 1589.1722 1619.5634 1625.9160 1636.4123 2855.0329 2865.7994 2908.2030 2913.2638 2916.3572 2943.6776 2950.2944 2955.1862 2981.1219 2982.2942 3029.8592 3032.2831 3032.6573 3035.5627 3036.1063 3038.0858 3050.3987 3073.1096 3075.1425 3087.1976 3090.0914 3090.4611 3090.5925 3100.6723 3120.7396 3180.5896 3201.8377 3280.7095 3548.4911
redmass: 4.1479 4.9675 4.0808 4.5142 4.8785 3.9839 5.0139 3.3892 5.2130 2.7059 4.8776 3.0204 3.1703 3.6082 5.1512 1.7652 2.7782 1.7631 2.7014 2.5642 2.0786 2.4005 3.4284 2.8152 3.2206 2.8292 3.3861 3.3976 3.5254 3.3952 2.7840 1.7833 2.1860 2.4024 3.9446 2.8290 2.8767 2.8166 3.4460 4.6527 4.8936 3.9773 6.1495 4.3811 2.2489 6.0551 5.4490 3.0555 2.7415 2.9439 3.1715 4.1908 1.4963 1.2794 2.1362 1.6019 3.2047 1.9774 1.6081 1.4486 1.9532 3.8830 1.5116 2.2862 4.3226 2.2093 2.3179 3.2654 1.3384 2.7216 6.0951 2.2153 1.9343 2.9871 1.8651 2.1680 2.4587 4.2196 2.1855 2.2348 2.0708 1.7720 2.6944 2.4054 1.2461 2.5524 1.7600 1.0653 2.2405 1.5736 1.2518 3.4454 1.4222 1.2865 1.3632 1.1357 1.2406 1.6578 1.2561 1.1976 2.0706 1.4452 1.3130 1.2245 1.3556 1.3252 1.3239 1.3817 1.6364 2.5653 1.3810 1.2551 1.2482 4.7935 1.0833 1.0843 1.0946 1.0930 1.0865 1.0540 1.1147 1.0541 1.0523 1.0479 1.0734 1.0726 1.0787 2.1738 3.4431 5.4386 6.4687 9.6691 8.1473 1.0721 1.0714 1.0689 1.0679 1.0695 1.0679 1.0674 1.0638 1.0357 1.0356 1.0869 1.0884 1.0950 1.0611 1.0935 1.0942 1.0890 1.0983 1.0980 1.0949 1.1003 1.0963 1.1002 1.0910 1.1077 1.0895 1.0963 1.0767 1.0658
irintensity: 0.1009 0.1508 0.1332 0.6322 1.9167 0.1493 1.8903 0.9698 0.7948 0.0614 6.1529 1.9270 1.5409 2.1960 0.0353 5.7254 2.7396 0.7673 1.9068 1.1797 2.3795 4.5644 7.4574 7.8880 2.2975 4.1962 10.2729 6.0142 7.5263 2.8279 24.8561 49.0135 60.4547 8.2610 8.2488 16.4041 9.8211 1.8174 6.8135 3.4602 5.6313 23.4273 9.3510 7.1083 9.2530 1.8985 14.4603 24.6643 14.0069 5.5746 2.2577 19.2664 3.3353 3.9320 7.1948 2.5178 30.5000 6.8435 2.3614 42.0783 36.4778 20.5997 71.2065 1.3986 9.6852 10.2944 11.5478 5.9279 2.9282 85.5454 425.8115 13.7843 18.0847 38.0732 69.1241 14.8504 34.0740 60.5401 3.5233 8.8141 207.9969 7.1393 15.9556 31.6029 25.2532 27.4412 29.9771 0.8124 47.4817 23.6636 4.6237 408.0181 8.5811 14.1495 18.2509 0.7798 11.9944 36.5611 2.4292 9.2124 8.2100 10.1378 12.7422 3.4796 1.4076 13.3890 13.2046 56.0871 67.7503 74.0870 2.8756 21.5213 22.1471 52.7037 3.0893 12.6832 28.3732 15.1333 17.6993 2.5798 10.8952 4.6657 1.0786 2.1559 10.5693 12.0524 11.0072 600.3925 207.1863 17.7666 178.3974 480.5910 163.5142 48.4632 147.2538 45.4271 89.9452 68.5231 38.7593 83.4787 68.0772 33.8749 33.9437 2.4516 29.5701 5.6816 33.1643 36.9808 36.0323 20.9765 45.7407 77.5215 35.1400 37.0845 32.9273 51.5532 15.6053 15.0604 1.9346 2.8240 378.7372 23.1893
temp: 298.150 k
press: 1.00000 atm
elementType: 8 8 8 8 8 7 7 7 6 6 6 6 6 6 6 6 6 6 6 6 6 6 6 6 6 6 6 1 1 1 1 1 1 1 1 1 1 1 1 1 1 1 1 1 1 1 1 1 1 1 1 1 1 1 1 1
symmnumber: 1
zpe: 1220229.8 jmol-1
zpe.correction: 0.464761 hartree
zpe.thermalcorrener: 0.491394 hartree
zpe.thermalcorrenthalpy: 0.492338 hartree
zpe.thermalcorrgfe: 0.405710 hartree
zpe.sumelectzpe: -1279.679952 hartree
zpe.sumelectthermal: -1279.653319 hartree
zpe.sumelectthermalent: -1279.652374 hartree
zpe.sumelectthermalfe: -1279.739002 hartree
dipole: 4.5019 -0.8790 2.3955
dipole: 5.1748
quadrupole: -138.2572 -172.8131 -156.9971
quadrupole: -6.9268 4.5265 0.2192
quadrupole: 17.7652 -16.7906 -0.9746 -6.9268 4.5265 0.2192
hfenergy: -1280.1447127 hartree
pointgroup: C01 [X(C19H29N3O5)]
dipole: 1.7311106 0.8544541 -0.6466571 debye
polarizability: 385.4392374|-2.075911|238.0115183|-21.6819824|27.7813916|179.8022575 unknown
InChI: InChI=1S/C19H29N3O5/c1-3-21(4-2)9-12-27-19(25)16-6-5-15(13-17(16)23)20-18(24)14-22-7-10-26-11-8-22/h5-6,13,20,23H,3-4,7-12,14H2,1-2H3
charge 0 multiplicity 1
56 atoms
O  7.585221 1.489761 0.991197
O  -3.095485 -1.346274 0.427243
O  3.462723 -3.072498 -1.119237
O  -0.488052 2.041585 0.889018
O  -3.000034 0.90556 1.034566
N  5.834535 -0.336701 -0.434443
N  -6.764707 -0.741535 -0.289887
N  3.204385 -0.802451 -0.487946
C  6.918652 0.404814 -1.140966
C  6.20603 -0.573111 0.99339
C  7.204868 1.72709 -0.410212
C  6.508989 0.765523 1.685026
C  5.418686 -1.584863 -1.119166
C  3.923981 -1.916139 -0.897471
C  -5.317227 -0.853965 -0.590445
C  -7.646435 -1.172872 -1.405263
C  -7.128949 0.588684 0.274336
C  -4.562648 -1.311095 0.673022
C  1.82241 -0.679802 -0.222337
C  -7.68487 -2.702831 -1.582187
C  -8.357452 0.53044 1.201787
C  -0.958169 -0.289403 0.352319
C  1.342481 0.586659 0.195782
C  0.911227 -1.764015 -0.357258
C  -0.027458 0.787984 0.48019
C  -0.444711 -1.547435 -0.070838
C  -2.407689 -0.128381 0.64239
H  7.855876 -0.198272 -1.186456
H  6.592333 0.616059 -2.176535
H  7.100531 -1.235816 1.062556
H  5.365827 -1.078979 1.505177
H  6.305119 2.379625 -0.450228
H  8.060593 2.252273 -0.864496
H  6.873211 0.605768 2.712621
H  5.590302 1.392574 1.712882
H  5.563739 -1.466191 -2.210087
H  6.00484 -2.476889 -0.810475
H  -4.884178 0.108231 -0.948652
H  -5.160341 -1.599831 -1.389434
H  -8.669118 -0.820812 -1.177217
H  -7.353405 -0.687332 -2.370844
H  -6.261759 0.96008 0.850906
H  -7.303534 1.336529 -0.539934
H  -4.770309 -0.633305 1.518954
H  -4.829886 -2.345327 0.938186
H  3.833708 0.014343 -0.364324
H  -8.367183 -2.980585 -2.407493
H  -8.037209 -3.182896 -0.652635
H  -6.687346 -3.114996 -1.821215
H  -9.261521 0.182859 0.669012
H  -8.168514 -0.16498 2.038128
H  -8.576711 1.53275 1.615213
H  2.043564 1.427055 0.297512
H  1.277499 -2.739914 -0.678584
H  -1.155267 -2.371214 -0.169595
H  0.262329 2.688158 0.930545
