program: Gaussian 09
title: 000203180
version: EM64L-G09RevD.01
frameworkgroup: C1[X(C20H30N2O4)]
method: RPBEPBE
basis: SDD
operation: Freq
keyword: #p
keyword: freq=noraman
keyword: PBEPBE/SDD
title: #p freq=noraman PBEPBE/SDD
converged: YES YES NO NO
title: Mulliken charges:
elementType: O O O O N N C C C C C C C C C C C C C C C C C C C C H H H H H H H H H H H H H H H H H H H H H H H H H H H H H H
charge: -0.245611 -0.267803 -0.416826 -0.347110 -0.158195 -0.450243 -0.398829 -0.390031 -0.390936 -0.374350 -0.363966 -0.454668 0.139673 -0.365309 -0.352251 -0.375244 -0.354987 0.555235 -0.308552 -0.694411 -0.612544 -0.377026 0.068680 0.203083 -0.331096 0.242823 0.222150 0.193702 0.203090 0.205389 0.201418 0.204652 0.232716 0.195117 0.185715 0.218942 0.245792 0.237284 0.198571 0.188077 0.361960 0.190207 0.194531 0.231025 0.209393 0.194676 0.196963 0.225017 0.234368 0.216518 0.210214 0.211248 0.253847 0.306490 0.265720 0.385700
chargesum: 0.00000
title: Mulliken charges with hydrogens summed into heavy atoms:
elementType: O O O O N N C C C C C C C C C C C C C C C C C C C C
charge: -0.245611 -0.267803 -0.031126 -0.347110 -0.158195 -0.088283 0.017023 0.018448 0.015134 0.053483 0.040691 0.028407 0.139673 0.021340 0.032488 0.065175 0.036652 0.555235 0.150832 -0.056432 -0.358697 -0.070536 0.068680 0.203083 -0.065376 0.242823
polarizability: 3.94836893e+02 -9.93373080e+00 2.29165201e+02 -1.91506264e+01 2.34315936e+01 1.82480735e+02
1716.lowfreq: -24.8594 -3.5502 -0.0020 0.0003 0.0015 1.2036 9.0607 13.1267 21.8014
frequency: -18.7759 12.9832 21.1209 36.1004 39.1024 43.2138 60.7790 61.2950 83.4790 89.5405 95.7802 110.4566 118.4477 128.6577 135.1320 157.5798 194.6716 220.3058 225.6665 231.8888 237.6368 255.9024 271.7582 292.5012 316.6680 326.7103 334.5861 351.8351 361.2255 388.9664 420.2366 425.2785 447.4918 454.5636 471.9353 485.7394 516.7905 554.1362 566.1079 579.8018 599.6201 629.3586 675.6940 682.8884 727.7693 746.3990 748.5066 757.2558 759.6444 796.7477 802.6498 806.7553 850.9895 853.1533 855.7689 860.1034 871.2645 877.4075 889.4609 890.3944 891.7127 914.0263 933.4964 955.0654 978.9130 984.2886 991.2722 994.1973 996.8765 1008.4366 1037.0248 1048.9331 1062.2006 1066.0524 1078.7108 1080.9933 1108.3934 1117.9772 1121.0708 1142.5888 1147.6232 1155.9693 1167.1302 1170.3742 1183.0285 1197.7109 1204.2248 1229.7305 1237.5401 1254.9113 1255.3014 1263.6940 1273.9458 1278.8439 1283.6179 1291.4271 1293.9671 1294.3033 1298.6474 1312.1978 1315.9355 1333.3324 1340.9898 1341.8969 1352.6952 1354.8339 1356.1234 1360.8951 1375.6148 1380.0534 1387.9160 1392.0943 1429.5109 1448.5829 1453.8426 1457.5591 1462.0320 1465.5870 1466.8952 1467.2633 1470.1068 1474.6506 1476.1882 1480.0434 1482.8985 1489.1018 1491.1711 1506.2070 1566.5325 1576.5980 1628.1560 1655.8607 2871.8481 2878.2222 2952.7576 2954.7613 2959.2571 2968.9055 2972.4397 2973.3462 2975.1424 2985.3046 2986.0919 2991.2256 2993.2833 3008.7403 3026.2283 3027.9711 3032.2545 3032.3071 3034.9868 3041.7483 3047.9023 3055.0975 3056.9196 3069.1643 3072.0466 3104.7851 3153.9655 3166.2984 3197.5965 3241.5921
redmass: 4.1545 5.1852 4.3459 4.1821 3.0773 1.6718 4.5065 3.4846 6.5490 4.3307 5.6139 2.5532 2.4065 2.2944 3.8343 6.0981 3.9377 3.0077 1.2244 2.0231 3.8203 3.9146 4.7077 3.7680 4.9969 2.6871 3.4538 5.5585 4.0456 2.0445 2.9021 6.0978 2.8506 2.9894 3.1034 3.3998 5.5304 3.3394 5.5275 4.2034 2.7445 7.0876 5.6807 3.5789 1.0721 1.5926 2.7639 1.9755 4.0291 3.2880 1.6124 1.3946 1.5059 3.0104 1.4176 1.1895 1.4304 3.6739 1.2988 2.3251 2.2115 5.2019 1.2114 1.3389 2.3566 2.3845 1.1561 1.3089 2.5899 3.9658 3.4480 2.1408 4.3916 3.2544 1.4925 2.2216 2.4817 2.6883 2.6362 1.6389 1.4232 1.8696 1.8837 2.3167 1.3009 1.6126 1.4599 1.8309 1.2758 1.3797 1.2967 1.2722 1.2837 2.0795 1.0591 1.1365 1.3311 1.2382 1.2015 2.1838 1.5995 1.3262 1.4097 1.4146 1.4838 1.7906 1.6706 1.4092 1.7266 1.5685 1.2177 4.7440 3.4209 1.0897 1.0914 1.1851 1.0872 1.0755 1.0755 1.1186 1.0844 1.0718 1.0428 1.1618 1.0841 1.1040 2.1275 2.5214 5.5705 3.6816 6.8399 5.1953 1.0706 1.0694 1.0644 1.0587 1.0590 1.0594 1.0364 1.0637 1.0688 1.0617 1.0622 1.0735 1.0833 1.1013 1.0573 1.0896 1.1041 1.0927 1.0942 1.0949 1.1023 1.1037 1.1038 1.1008 1.0993 1.1091 1.0921 1.0901 1.0960 1.0768
irintensity: 0.4991 0.2364 0.1329 0.4625 0.4560 0.0283 0.7428 0.3982 6.9812 1.1241 1.5614 0.9172 0.4476 0.2202 1.8827 0.3861 4.4658 0.3730 0.1087 0.8235 1.2444 2.0884 2.4932 5.4887 1.1477 6.2469 2.7863 30.2079 1.5666 1.0956 2.4699 41.3714 1.2246 5.7006 4.3215 2.5005 8.9387 2.2882 1.5142 5.9570 6.9358 0.2154 12.7837 16.9748 11.0835 3.8845 0.8741 2.7037 28.9049 0.3097 0.8374 1.9853 2.3360 7.0128 5.7250 188.5160 0.4934 34.4886 0.1783 3.6846 11.2339 18.5564 63.7634 10.8919 28.3112 20.9973 0.9969 0.9446 24.4575 2.4126 13.1239 12.6711 207.0488 123.0549 5.9809 0.3818 33.7302 5.9340 23.9183 94.3405 13.3768 23.5971 27.9095 12.7370 7.5168 77.8549 7.9705 86.1646 11.0556 8.2374 13.7836 0.2798 25.6848 388.8402 7.1851 0.0914 8.7272 38.4626 14.6973 13.5715 5.4260 1.1766 8.5131 0.3122 12.8138 519.3353 70.5341 0.6746 184.1108 54.0136 11.3883 46.7147 122.2965 14.6110 6.9766 22.2625 15.7574 2.9671 0.8069 41.1129 7.0083 3.3873 12.4839 31.0454 3.3866 23.3395 147.5215 516.7210 72.3660 186.9077 309.1315 384.1635 36.6364 165.9967 51.2135 1.7905 7.9975 92.3198 50.9640 56.0613 355.9622 23.4608 22.9500 13.3095 12.8946 0.7862 50.9016 39.1652 34.6144 35.7945 36.1783 33.9765 24.1546 31.0978 103.0124 92.7587 55.7471 24.1723 6.2252 1.9666 4.5663 473.3479
temp: 298.150 k
press: 1.00000 atm
elementType: 8 8 8 8 7 7 6 6 6 6 6 6 6 6 6 6 6 6 6 6 6 6 6 6 6 6 1 1 1 1 1 1 1 1 1 1 1 1 1 1 1 1 1 1 1 1 1 1 1 1 1 1 1 1 1 1
symmnumber: 1
zpe: 1245238.8 jmol-1
zpe.correction: 0.474286 hartree
zpe.thermalcorrener: 0.500249 hartree
zpe.thermalcorrenthalpy: 0.501193 hartree
zpe.thermalcorrgfe: 0.415106 hartree
zpe.sumelectzpe: -1188.563585 hartree
zpe.sumelectthermal: -1188.537622 hartree
zpe.sumelectthermalent: -1188.536678 hartree
zpe.sumelectthermalfe: -1188.622765 hartree
dipole: -2.3374 -1.2225 0.7963
dipole: 2.7553
quadrupole: -101.4990 -168.8820 -160.7439
quadrupole: 15.0300 0.7136 -7.7889
quadrupole: 42.2093 -25.1737 -17.0356 15.0300 0.7136 -7.7889
hfenergy: -1189.037871 hartree
pointgroup: C01 [X(C20H30N2O4)]
dipole: -0.9593338 -0.4628418 -0.2014364 debye
polarizability: 393.5022881|-1.9883824|173.9600035|-24.6862377|11.7756406|239.0205372 unknown
InChI: InChI=1S/C20H30N2O4/c1-2-3-4-8-13-26-20(25)17-10-9-16(14-18(17)23)21-19(24)15-22-11-6-5-7-12-22/h9-10,14,21,23H,2-8,11-13,15H2,1H3
charge 0 multiplicity 1
56 atoms
O  -3.086726 0.738285 3.264509
O  3.422983 0.966919 0.442881
O  0.407119 0.311133 -2.479206
O  2.882542 0.590259 -1.793685
N  -5.585643 -0.078097 0.676648
N  -2.999156 0.478482 0.908127
C  -7.16969 -1.542625 -1.327407
C  -5.882995 -2.138379 -0.712078
C  -7.113307 0.002091 -1.29554
C  -5.638142 -1.570554 0.699653
C  -6.841125 0.514333 0.133044
C  -5.174558 0.483122 1.98612
C  -3.636249 0.56747 2.137496
C  6.979195 -0.432699 -0.17316
C  7.605982 -1.840985 -0.060423
C  5.463239 -0.432641 0.135246
C  9.117497 -1.862766 -0.383114
C  -1.625588 0.550926 0.596929
C  4.871299 0.980236 0.065027
C  9.737787 -3.270739 -0.254188
C  -1.256542 0.403107 -0.76161
C  -0.626829 0.76568 1.599241
C  1.114889 0.681746 -0.144259
C  0.099465 0.464829 -1.142267
C  0.716719 0.827572 1.214219
C  2.513604 0.736254 -0.572694
H  -7.303646 -1.901475 -2.364868
H  -8.050473 -1.891612 -0.749471
H  -5.015023 -1.894579 -1.355885
H  -5.950202 -3.24117 -0.653748
H  -8.062464 0.435746 -1.663657
H  -6.304022 0.35692 -1.963361
H  -4.679836 -1.944227 1.106159
H  -6.448842 -1.918028 1.387627
H  -7.713989 0.263906 0.786445
H  -6.731022 1.614578 0.131011
H  -5.561153 1.515776 2.082358
H  -5.562007 -0.087669 2.8574
H  7.150315 -0.037149 -1.195703
H  7.502755 0.25581 0.522898
H  -3.698277 0.318083 0.15329
H  7.445169 -2.232871 0.965573
H  7.075626 -2.534549 -0.745419
H  4.936329 -1.08262 -0.588572
H  5.28684 -0.850293 1.145543
H  9.645505 -1.161076 0.294656
H  9.276206 -1.480291 -1.41212
H  5.326935 1.653234 0.810215
H  4.967863 1.406365 -0.949306
H  10.816618 -3.261584 -0.495348
H  9.624711 -3.661293 0.77476
H  9.244265 -3.98533 -0.939657
H  -2.006656 0.239653 -1.542085
H  -0.931035 0.875697 2.641118
H  1.494811 0.991688 1.965246
H  1.424525 0.3780 -2.571203
