program: Gaussian 09
title: 000203168
version: EM64L-G09RevD.01
frameworkgroup: C1[X(C18H28N2O4)]
method: RPBEPBE
basis: SDD
operation: Freq
keyword: #p
keyword: freq=noraman
keyword: PBEPBE/SDD
title: #p freq=noraman PBEPBE/SDD
converged: YES YES NO NO
title: Mulliken charges:
elementType: O O O O N N C C C C C C C C C C C C C C C C C C H H H H H H H H H H H H H H H H H H H H H H H H H H H H
charge: -0.271579 -0.247892 -0.416904 -0.345167 -0.178838 -0.449885 -0.342481 -0.478411 -0.384667 -0.329732 -0.318365 -0.353164 -0.267553 0.147926 -0.669074 -0.667389 -0.692250 0.555520 0.066913 -0.614443 -0.377135 0.203460 0.240361 -0.328935 0.189807 0.190299 0.245475 0.246364 0.211069 0.211556 0.203443 0.229681 0.200334 0.210136 0.197827 0.197744 0.228378 0.229035 0.221827 0.211509 0.222510 0.224650 0.214614 0.218366 0.210642 0.210546 0.218696 0.364238 0.253689 0.306456 0.264593 0.386204
chargesum: 0.00000
title: Mulliken charges with hydrogens summed into heavy atoms:
elementType: O O O O N N C C C C C C C C C C C C C C C C C C
charge: -0.271579 -0.247892 -0.030700 -0.345167 -0.178838 -0.085648 0.037625 0.013428 0.037958 0.103392 0.092105 0.042408 0.189860 0.147926 -0.013228 -0.009760 -0.052366 0.555520 0.066913 -0.360754 -0.070679 0.203460 0.240361 -0.064342
polarizability: 3.69599207e+02 2.24353275e+01 2.29487515e+02 1.35415715e+00 -2.38453438e+00 1.51662089e+02
1716.lowfreq: -7.5065 -5.2101 -0.0010 0.0005 0.0012 5.4016 7.5516 22.3348 26.2616
frequency: 5.9425 21.9216 25.9978 32.6861 38.3369 41.4573 52.4438 74.2586 82.1827 84.3405 91.9139 104.8895 107.9512 114.9592 144.5232 159.4824 175.1243 181.6189 197.8206 215.7030 229.7353 244.0481 254.6090 265.2057 283.8106 291.6928 317.4736 330.1485 354.5931 392.0840 400.2073 430.6515 445.9433 456.4751 473.0165 511.4460 514.9979 564.8886 572.1963 575.4454 630.2775 679.9714 684.3393 729.5392 749.3490 751.8689 762.9188 785.0110 794.6368 797.8612 810.3691 841.9316 851.2518 861.1290 870.7550 873.1107 892.3612 895.5179 921.6428 932.9129 964.6824 979.9224 988.1964 994.8851 996.8446 1018.8538 1062.7414 1067.0383 1070.1529 1073.2266 1078.6358 1088.7301 1110.6466 1126.5815 1143.7696 1147.8998 1157.5011 1168.5542 1195.7909 1200.7604 1202.2284 1229.9574 1248.0325 1250.7515 1256.6047 1276.0198 1281.5066 1281.9631 1288.0781 1291.5890 1311.2218 1318.1228 1330.5424 1350.3626 1356.9168 1364.5745 1370.1384 1380.5579 1390.6701 1391.8328 1393.7406 1394.7158 1431.9957 1449.0052 1466.5857 1466.6839 1466.9829 1468.7083 1473.7051 1474.2742 1477.4967 1478.7394 1482.8614 1483.4320 1487.8512 1490.2129 1493.1560 1505.2550 1565.3511 1575.6942 1626.0793 1655.7362 2894.8741 2900.8096 2957.7737 2958.0718 2970.6470 2971.9782 2973.1085 2985.9802 2986.9865 2990.8164 2998.2747 3004.3768 3024.9805 3029.0495 3046.0906 3046.9711 3049.3125 3069.3285 3073.4486 3078.8734 3080.7690 3084.4743 3086.9725 3090.7568 3152.9313 3165.0717 3197.3344 3230.2462
redmass: 4.1343 3.4111 4.0198 3.8999 2.0304 2.8637 3.5185 4.0040 3.1829 2.8417 2.1731 2.3049 3.0173 3.0884 4.9203 2.7752 3.8382 2.5429 1.5349 2.0378 1.1062 5.5377 3.3601 4.1033 2.2390 3.1669 5.3136 3.0593 4.5480 4.2200 3.5112 5.0000 2.6729 3.0067 3.9958 4.8361 4.3956 4.2424 4.6411 5.2441 7.1496 5.9146 3.5258 1.0694 3.2478 2.7203 1.1207 3.2501 1.9645 1.3180 2.4033 1.1800 1.5146 1.2049 1.5474 2.7767 1.8762 3.1775 3.5035 1.2542 1.1598 2.7911 2.0292 1.3084 2.4420 3.7003 3.7505 2.8994 2.6133 1.8920 2.8433 2.1575 1.9529 2.6107 1.6371 1.4619 1.9462 2.4138 1.6223 2.2120 1.4379 1.8268 1.3506 1.3005 1.2261 2.0814 1.1018 1.1996 1.1957 1.0846 2.5200 1.3767 1.3938 1.6285 1.7201 1.3258 1.3891 2.4705 1.2737 1.2493 1.2601 3.1319 4.2683 1.0830 1.0798 1.0578 1.0727 1.0657 1.0670 1.0742 1.0428 1.0551 1.1006 1.0890 1.4126 1.0973 1.5188 2.5265 5.7978 3.7481 7.0839 5.2225 1.0714 1.0705 1.0587 1.0665 1.0589 1.0678 1.0381 1.0359 1.0360 1.0598 1.0991 1.0566 1.1028 1.0903 1.0894 1.1041 1.0938 1.1013 1.0992 1.1080 1.0984 1.0984 1.1003 1.1005 1.0921 1.0902 1.0959 1.0769
irintensity: 0.7332 0.2212 0.4971 0.1324 0.6126 0.1411 1.4348 3.2358 1.7521 0.8556 1.6670 1.1322 0.5062 1.0173 1.0161 1.3013 3.2692 4.5630 0.5202 3.1265 0.0056 0.8111 3.1204 4.2127 1.0719 4.3643 0.4501 0.7771 26.9465 7.1728 0.7571 36.7513 3.4352 5.8596 8.0507 3.2767 10.2372 3.8087 13.3150 1.6451 0.1020 15.1550 16.2423 10.6969 0.4239 23.5712 0.0048 1.7396 9.1748 3.1535 1.0871 0.5051 1.6520 186.9512 3.3124 14.0553 12.7808 10.6014 19.5394 66.6367 1.1321 16.1417 18.2343 1.0502 9.8523 0.1991 290.9442 58.2451 0.9784 22.2341 79.2228 6.4421 21.8179 1.0029 137.4366 0.7090 23.6178 5.5152 94.7514 21.1902 0.5858 106.4191 23.6496 8.6558 1.0130 498.3239 0.3702 3.1670 20.6940 0.6229 16.8231 18.6112 6.9637 398.6505 174.1130 2.1641 12.1579 193.0664 20.0535 17.0021 19.1747 75.6744 79.2215 2.7806 1.5306 20.9853 0.2408 11.2187 37.8104 5.7890 12.9750 10.1007 7.3534 35.2070 70.9683 34.1517 74.7987 516.0205 81.6548 176.9277 305.3445 376.8866 26.2291 182.8429 10.1198 50.4603 42.3781 407.7462 5.3360 23.0621 17.5581 20.1121 1.2139 41.5121 15.8909 11.9667 6.3400 10.9417 12.6874 55.2351 50.0874 88.0952 40.2394 42.0800 78.7906 36.4977 6.4628 2.1256 4.5931 459.4742
temp: 298.150 k
press: 1.00000 atm
elementType: 8 8 8 8 7 7 6 6 6 6 6 6 6 6 6 6 6 6 6 6 6 6 6 6 1 1 1 1 1 1 1 1 1 1 1 1 1 1 1 1 1 1 1 1 1 1 1 1 1 1 1 1
symmnumber: 1
zpe: 1146588.5 jmol-1
zpe.correction: 0.436713 hartree
zpe.thermalcorrener: 0.463563 hartree
zpe.thermalcorrenthalpy: 0.464507 hartree
zpe.thermalcorrgfe: 0.374490 hartree
zpe.sumelectzpe: -1111.286260 hartree
zpe.sumelectthermal: -1111.259410 hartree
zpe.sumelectthermalent: -1111.258466 hartree
zpe.sumelectthermalfe: -1111.348483 hartree
dipole: -2.4457 -0.0307 0.2814
dipole: 2.4621
quadrupole: -87.5709 -164.8706 -143.2705
quadrupole: -9.5030 -0.0527 1.6827
quadrupole: 44.3331 -32.9666 -11.3665 -9.5030 -0.0527 1.6827
hfenergy: -1111.7229725 hartree
pointgroup: C01 [X(C18H28N2O4)]
dipole: -0.96628 0.0662618 0.013765 debye
polarizability: 367.4711569|2.8564362|163.9828116|-29.3700862|27.6951788|219.2948421 unknown
InChI: InChI=1S/C18H28N2O4/c1-4-7-8-11-24-18(23)15-10-9-14(12-16(15)21)19-17(22)13-20(5-2)6-3/h9-10,12,19,21H,4-8,11,13H2,1-3H3
charge 0 multiplicity 1
52 atoms
O  3.383538 0.489954 -0.311297
O  -2.919914 1.50359 2.809259
O  0.145573 -0.877715 -2.697468
O  2.66925 -0.498217 -2.293032
N  -5.65447 0.480635 0.543146
N  -3.001482 0.454495 0.682644
C  7.18771 0.870727 -0.126396
C  -5.085744 0.79665 1.879277
C  5.695123 0.960624 0.270298
C  -5.988668 1.726648 -0.217958
C  -6.775878 -0.505549 0.590656
C  8.124374 1.486328 0.938303
C  4.790048 0.361202 -0.804854
C  -3.548429 0.974144 1.846335
C  -6.054385 1.513328 -1.740833
C  -6.300234 -1.939938 0.884109
C  9.615449 1.391412 0.550386
C  -1.653453 0.374046 0.277448
C  1.028497 0.155954 -0.637937
C  -1.386691 -0.198457 -0.989361
C  -0.580344 0.843872 1.099703
C  -0.060955 -0.312348 -1.455248
C  2.392359 0.018766 -1.151036
C  0.732849 0.727695 0.631277
H  7.349463 1.387393 -1.095426
H  7.468136 -0.190983 -0.287874
H  -5.514989 1.714408 2.334901
H  -5.292949 -0.031675 2.581208
H  5.413026 2.018206 0.435864
H  5.527594 0.428016 1.226193
H  -6.946863 2.165809 0.149807
H  -5.19581 2.465706 0.002515
H  -7.544247 -0.195551 1.338998
H  -7.272319 -0.492496 -0.395498
H  7.847588 2.54858 1.095387
H  7.958899 0.974874 1.908235
H  4.999006 -0.70986 -0.982734
H  4.871077 0.894264 -1.769974
H  -5.093131 1.124869 -2.122133
H  -6.850475 0.805691 -2.032949
H  -6.262611 2.473616 -2.246737
H  -5.589415 -2.278081 0.109759
H  -5.799233 -2.02239 1.865687
H  -7.162045 -2.63211 0.893446
H  9.9256 0.337432 0.419795
H  9.812537 1.919142 -0.401911
H  10.26335 1.84025 1.32536
H  -3.759243 0.103056 0.059814
H  -2.19403 -0.565631 -1.631379
H  -0.805493 1.281967 2.07315
H  1.566659 1.079343 1.245932
H  1.154496 -0.880493 -2.871462
