program: Gaussian 09
title: 000203170
version: EM64L-G09RevD.01
frameworkgroup: C1[X(C19H28N2O4)]
method: RPBEPBE
basis: SDD
operation: Freq
keyword: #p
keyword: freq=noraman
keyword: PBEPBE/SDD
title: #p freq=noraman PBEPBE/SDD
converged: YES YES NO NO
title: Mulliken charges:
elementType: O O O O N N C C C C C C C C C C C C C C C C C C C H H H H H H H H H H H H H H H H H H H H H H H H H H H H
charge: -0.242344 -0.297879 -0.385526 -0.226160 -0.158198 -0.452323 -0.399057 -0.389555 -0.390751 -0.374407 -0.363033 -0.455408 0.137872 0.568228 -0.343493 -0.367568 -0.354968 -0.302425 -0.673207 -0.385541 0.118611 0.206186 -0.292103 -0.694000 0.177181 0.195697 0.221642 0.207308 0.196609 0.200230 0.202958 0.196540 0.234044 0.219104 0.186687 0.237451 0.245650 0.354609 0.195172 0.183231 0.201125 0.229642 0.195588 0.200970 0.227453 0.217032 0.216851 0.306705 0.216087 0.211421 0.209025 0.279294 0.351744
chargesum: 0.00000
title: Mulliken charges with hydrogens summed into heavy atoms:
elementType: O O O O N N C C C C C C C C C C C C C C C C C C C
charge: -0.242344 -0.297879 -0.033782 -0.226160 -0.158198 -0.097714 0.018283 0.014361 0.012437 0.056177 0.042758 0.027693 0.137872 0.568228 0.034910 0.063200 0.041590 0.142060 -0.456356 -0.078836 0.118611 0.206186 -0.012809 -0.057468 0.177181
polarizability: 3.68758734e+02 1.32409750e+01 2.32362778e+02 6.66410715e+00 8.20687716e+00 1.60377740e+02
1716.lowfreq: -26.8874 -9.4117 -0.9643 -0.0014 0.0010 0.0015 2.2999 11.0126 27.3818
frequency: -16.7083 9.9787 27.2464 33.5444 35.8427 39.6230 49.3782 68.6472 77.4066 84.0941 99.5174 124.1048 124.9992 131.5519 158.1342 192.1303 221.4564 223.0651 232.8469 239.7339 268.7301 290.2496 304.4086 311.3408 321.8455 331.6808 337.6557 374.6091 384.4045 394.5925 404.3859 446.3639 452.3025 469.3173 482.9536 511.5060 552.8084 562.0669 576.7402 597.5317 628.5720 672.5874 678.0364 732.1596 736.4332 751.8564 759.4629 772.3291 796.4446 802.1492 825.7785 850.5344 851.4956 854.8172 870.1689 875.1539 891.9023 893.9518 919.9957 929.1796 955.1049 969.9146 980.4228 988.0503 997.6691 1000.1613 1008.4547 1023.0835 1047.6093 1058.1962 1074.2665 1078.9828 1104.5679 1107.5317 1116.8082 1119.4444 1145.6132 1154.4411 1161.5037 1165.1249 1174.6697 1182.8007 1207.7955 1211.2006 1232.1308 1250.2038 1253.7416 1262.3539 1272.6326 1272.8084 1285.8088 1290.1455 1292.3859 1297.7298 1310.6429 1313.0960 1319.8824 1333.7927 1340.4580 1349.8651 1354.9771 1359.9484 1373.0442 1373.9854 1380.5260 1388.3021 1414.2705 1449.6095 1451.3970 1453.2762 1462.3228 1466.1634 1466.3821 1469.6668 1470.0118 1475.4466 1479.8455 1480.2734 1488.0660 1507.2556 1514.3829 1588.1962 1619.7627 1627.6492 1636.3540 2873.2776 2880.0387 2952.0901 2955.7871 2970.0706 2972.2842 2973.9649 2983.8702 2986.0113 2989.2711 2998.3423 3016.8084 3025.1134 3028.6616 3032.7287 3034.7454 3042.0270 3047.7733 3051.2578 3056.6844 3069.0639 3071.8888 3093.7156 3101.6889 3180.0626 3200.4083 3244.8844 3547.8876
redmass: 3.9635 4.7864 4.2558 4.1504 3.4779 3.8373 2.1136 4.5633 3.9275 5.6392 3.3278 2.5485 3.0614 3.1319 4.2125 4.3706 1.2142 3.4331 2.9544 2.5159 4.9129 3.6148 4.2846 3.8094 2.4390 3.2414 3.6659 3.6063 1.3235 2.5418 3.6955 2.8586 2.9372 3.1742 2.8183 5.1932 3.1484 6.5258 4.3300 2.6300 6.9489 5.1092 3.2394 1.0999 2.6191 3.2361 3.9794 1.3403 3.0408 1.8098 1.9509 1.6728 1.8359 1.4609 1.4820 3.2160 2.9500 2.0810 1.2579 3.9236 1.3254 1.1762 2.1785 2.6919 2.9100 1.3308 4.3397 5.6286 2.1322 2.8906 2.5423 1.4861 2.3362 2.2431 2.6116 2.5076 1.3581 1.9822 1.3537 1.6023 1.6258 1.7279 1.5931 1.4327 3.3242 1.2766 1.3837 1.3177 1.2198 1.2405 1.0490 1.6787 1.3345 1.1304 1.8149 1.6727 1.3479 1.3225 1.4227 1.4833 1.5852 1.4263 1.7128 1.6710 2.0856 1.2189 4.7899 1.0877 1.0985 1.0926 1.0869 1.0999 1.0674 1.0813 1.0729 1.0430 1.0705 1.1235 1.0906 2.0518 3.5729 5.4460 6.2696 9.8038 8.2968 1.0706 1.0695 1.0645 1.0588 1.0577 1.0380 1.0635 1.0621 1.0617 1.0617 1.0963 1.0571 1.1026 1.0898 1.0924 1.0944 1.0948 1.1020 1.1034 1.1038 1.1007 1.0994 1.1084 1.0910 1.0894 1.0965 1.0769 1.0657
irintensity: 0.5015 0.3140 0.3579 1.7554 0.2245 0.3269 0.7910 0.2719 2.1742 4.9129 1.4114 0.6928 1.1094 0.6684 1.7569 4.1527 0.2033 2.1712 0.4549 0.8534 6.6502 8.2225 12.4216 8.8886 2.9367 2.4912 2.9586 7.9239 98.3962 15.1702 24.1973 1.0741 11.6705 3.7021 3.5262 8.0448 9.3175 11.7465 7.4836 5.8754 0.9646 12.4643 22.7077 7.8621 14.1980 2.7468 25.8592 0.7878 0.9307 1.9893 9.3704 7.7793 8.0329 4.4283 53.2311 4.5488 9.3453 20.2147 63.1739 1.5883 8.9496 1.3719 26.2786 13.9221 52.4275 0.9826 134.2874 306.0953 12.9563 49.6170 4.6112 6.2346 98.6679 158.9180 4.5564 6.0945 5.5392 21.3929 39.5145 5.7723 33.5688 10.7108 24.0763 31.7722 390.6491 9.4831 6.5988 0.5069 2.5197 13.8307 0.8852 26.5091 8.3676 0.2572 13.8053 5.1781 6.5397 0.5798 0.2878 1.3628 0.0708 3.1810 92.4404 80.4475 30.6226 12.4651 54.0933 23.7807 32.9852 5.4392 17.3129 23.5126 0.4914 7.0927 1.3369 12.1571 3.6898 14.8450 22.7142 484.4310 327.7084 23.3428 243.8730 409.8663 173.5773 45.6464 145.4741 49.0877 13.9571 57.4368 35.2000 37.9829 24.6450 25.9238 21.6352 4.3610 66.6050 16.8290 37.6349 36.4906 34.3817 33.8342 24.1549 16.4828 104.3749 80.1817 55.8988 33.8621 15.3666 1.9329 2.5772 443.2340 22.2149
temp: 298.150 k
press: 1.00000 atm
elementType: 8 8 8 8 7 7 6 6 6 6 6 6 6 6 6 6 6 6 6 6 6 6 6 6 6 1 1 1 1 1 1 1 1 1 1 1 1 1 1 1 1 1 1 1 1 1 1 1 1 1 1 1 1
symmnumber: 1
zpe: 1169256.5 jmol-1
zpe.correction: 0.445346 hartree
zpe.thermalcorrener: 0.470498 hartree
zpe.thermalcorrenthalpy: 0.471442 hartree
zpe.thermalcorrgfe: 0.386907 hartree
zpe.sumelectzpe: -1149.316660 hartree
zpe.sumelectthermal: -1149.291508 hartree
zpe.sumelectthermalent: -1149.290564 hartree
zpe.sumelectthermalfe: -1149.375099 hartree
dipole: 6.2994 -2.0559 0.9012
dipole: 6.6874
quadrupole: -108.8888 -160.0021 -150.0655
quadrupole: -19.7364 -2.2514 -1.7600
quadrupole: 30.7634 -20.3500 -10.4134 -19.7364 -2.2514 -1.7600
hfenergy: -1149.7620061 hartree
pointgroup: C01 [X(C19H28N2O4)]
dipole: 2.5231295 0.2372851 0.7069132 debye
polarizability: 366.6053318|-21.7164927|162.9644109|-12.7849041|11.233245|231.9295097 unknown
InChI: InChI=1S/C19H28N2O4/c1-2-3-7-12-25-19(24)16-9-8-15(13-17(16)22)20-18(23)14-21-10-5-4-6-11-21/h8-9,13,20,22H,2-7,10-12,14H2,1H3
charge 0 multiplicity 1
53 atoms
O  2.623944 -0.750501 -2.951588
O  -3.809356 -0.291695 -0.317924
O  -0.870742 -0.044897 2.805934
O  -3.495426 0.12648 1.957533
N  5.204045 -0.289071 -0.359051
N  2.568767 -0.531418 -0.591109
C  6.956846 0.974382 1.64304
C  5.733076 1.709919 1.050765
C  6.738771 -0.555428 1.591986
C  5.414012 1.190121 -0.364703
C  6.398842 -1.015139 0.160289
C  4.727164 -0.784266 -1.673649
C  3.190678 -0.67362 -1.823232
C  1.194423 -0.434043 -0.2870
C  -7.271161 1.426033 -0.147012
C  -5.735113 1.294083 -0.267719
C  -7.762693 2.880544 -0.329298
C  -5.276434 -0.16228 -0.106211
C  0.830303 -0.286728 1.07518
C  0.177664 -0.478734 -1.28161
C  -1.561123 -0.22153 0.474304
C  -0.525649 -0.181535 1.458833
C  -1.163327 -0.373644 -0.883856
C  -9.295835 3.015927 -0.209064
C  -3.000341 -0.102649 0.82837
H  7.862016 1.236631 1.057397
H  7.140304 1.30373 2.682734
H  5.914848 2.800249 1.005325
H  4.851316 1.549628 1.702411
H  5.904424 -0.834618 2.265059
H  7.64145 -1.091143 1.941814
H  6.249815 1.459381 -1.057397
H  4.496828 1.668823 -0.75544
H  6.177257 -2.098424 0.147159
H  7.285157 -0.844252 -0.500409
H  5.182634 -0.258475 -2.540335
H  4.983681 -1.856017 -1.776735
H  3.282175 -0.476107 0.164791
H  -7.599526 1.053031 0.845357
H  -7.762466 0.778996 -0.904096
H  -5.403432 1.671989 -1.254685
H  -5.244402 1.91446 0.505901
H  -7.433113 3.254077 -1.320311
H  -7.271469 3.52671 0.426021
H  -5.527646 -0.544125 0.900107
H  -5.715189 -0.813566 -0.881493
H  1.613434 -0.257798 1.845854
H  0.455338 -0.593134 -2.330353
H  -9.621282 4.063258 -0.348741
H  -9.647094 2.6831 0.785879
H  -9.80958 2.398012 -0.969799
H  -1.954048 -0.40779 -1.636808
H  -0.056065 -0.044335 3.37088
