program: Gaussian 09
title: 000203134
version: EM64L-G09RevD.01
frameworkgroup: C1[X(C11H15N3O2)]
method: RPBEPBE
basis: SDD
operation: Freq
keyword: #p
keyword: freq=noraman
keyword: PBEPBE/SDD
title: #p freq=noraman PBEPBE/SDD
converged: YES YES NO NO
title: Mulliken charges:
elementType: O O N N N C C C C C C C C C C C H H H H H H H H H H H H H H H
charge: -0.282428 -0.299459 -0.365981 -0.450732 0.004205 -0.328805 -0.382826 -0.351331 -0.686681 0.241820 0.233910 0.189608 -0.242044 -0.431490 -0.174993 -0.323708 0.214160 0.194919 0.210981 0.253570 0.191249 0.208040 0.213048 0.217523 0.208123 0.371815 0.348942 0.285876 0.239239 0.240671 0.252780
chargesum: 0.00000
title: Mulliken charges with hydrogens summed into heavy atoms:
elementType: O O N N N C C C C C C C C C C C
charge: -0.282428 -0.299459 0.005833 -0.101790 0.004205 0.080275 0.081725 0.047958 -0.047987 0.241820 0.233910 0.189608 0.043832 -0.192251 0.065678 -0.070928
polarizability: 2.09417671e+02 1.36998399e+01 1.36869010e+02 -1.15098604e+01 2.10457592e+01 9.90023507e+01
1716.lowfreq: -7.0427 -4.5861 -0.0002 0.0006 0.0007 3.8392 14.0182 25.2000 32.4763
frequency: 13.3741 25.1268 32.4207 62.2858 78.4014 98.9961 130.2597 141.8367 183.0874 202.1389 228.3470 241.4031 280.9442 305.8104 352.3880 375.6394 409.9282 428.7802 470.4034 514.5058 605.6790 629.5798 651.0098 699.1590 706.6424 715.7296 730.8160 739.3172 798.5388 810.0700 837.5102 840.0429 872.5039 894.1836 914.3471 963.2512 973.3696 982.5974 1001.2241 1007.6164 1026.3737 1051.5217 1093.1080 1109.0579 1118.3596 1135.4312 1149.0543 1197.8652 1211.7230 1229.1851 1264.0661 1267.9995 1290.9014 1313.2367 1314.5662 1338.7973 1350.1924 1364.1933 1390.2591 1407.3923 1428.6570 1457.3845 1460.4240 1473.8965 1474.3031 1478.0377 1486.1213 1521.6076 1546.2381 1583.7390 1590.7894 1680.9388 2963.6567 2973.2097 2976.9893 2992.2193 3009.6595 3042.8737 3069.9196 3074.5412 3078.2688 3107.0456 3140.7396 3158.7254 3177.0879 3354.7512 3539.9217
redmass: 4.4825 4.6399 5.0499 4.7247 1.7303 4.2852 3.8745 4.9744 4.4141 4.0106 1.4686 2.1607 2.7503 6.0192 3.4389 3.0055 7.7476 5.2186 5.1639 2.7491 7.4520 3.6720 1.6457 4.8567 5.6999 2.0082 1.4099 2.2332 1.4542 1.3134 1.8078 2.4961 4.9743 1.6710 1.4625 1.4544 1.5408 2.4564 3.5544 1.4358 3.5320 2.8760 2.8115 1.5965 2.0153 2.6598 2.3862 1.4763 2.3175 1.3281 2.0677 1.3624 1.1139 10.9674 1.2052 1.3220 1.4313 1.3823 1.2120 1.9708 2.1437 1.0802 1.1289 2.1520 1.0614 1.0431 1.0803 2.4604 3.5385 5.7631 4.2346 5.8187 1.0594 1.0382 1.0589 1.0666 1.0976 1.1012 1.1007 1.0994 1.0995 1.0911 1.0892 1.0917 1.1001 1.0813 1.0771
irintensity: 1.2882 0.0073 0.7822 0.8376 0.0981 0.2827 2.5903 11.4509 2.8676 3.8215 2.8306 9.7993 2.0437 14.0325 17.1155 2.0358 0.5925 4.5712 5.0107 2.8824 2.1726 12.9924 41.4566 7.7332 1.0081 13.6006 37.6860 79.8722 29.8206 116.9209 8.1243 3.4902 8.5744 5.3646 4.3515 1.0702 10.5669 12.6004 15.0775 1.2551 0.0227 3.0302 0.8368 20.3931 8.7905 3.2152 15.7274 28.4299 176.4961 6.8502 208.2601 3.1040 1.3196 5.8756 17.4463 2.8743 3.4289 7.0391 10.4132 23.1555 262.6513 4.7251 18.5382 75.8915 7.5432 9.8165 17.3769 509.7411 83.9179 17.2192 43.5945 373.2850 20.1982 23.9887 64.8632 36.1198 2.3105 47.5797 87.8010 40.6527 14.8412 22.6270 6.6867 7.2900 16.7636 180.2415 30.5136
temp: 298.150 k
press: 1.00000 atm
elementType: 8 8 7 7 7 6 6 6 6 6 6 6 6 6 6 6 1 1 1 1 1 1 1 1 1 1 1 1 1 1 1
symmnumber: 1
zpe: 660424.1 jmol-1
zpe.correction: 0.251542 hartree
zpe.thermalcorrener: 0.267462 hartree
zpe.thermalcorrenthalpy: 0.268406 hartree
zpe.thermalcorrgfe: 0.204807 hartree
zpe.sumelectzpe: -741.710599 hartree
zpe.sumelectthermal: -741.694679 hartree
zpe.sumelectthermalent: -741.693735 hartree
zpe.sumelectthermalfe: -741.757334 hartree
dipole: -0.9543 -2.9489 -1.4473
dipole: 3.4208
quadrupole: -81.8991 -104.1563 -97.1832
quadrupole: 3.7648 3.2858 -0.9863
quadrupole: 12.5138 -9.7434 -2.7703 3.7648 3.2858 -0.9863
hfenergy: -741.962141 hartree
pointgroup: C01 [X(C11H15N3O2)]
dipole: 0.3779257 -1.126285 -0.6323881 debye
polarizability: 209.1997002|2.2222511|130.9654573|-18.5133794|25.0366086|105.1238747 unknown
InChI: InChI=1S/C11H15N3O2/c1-2-3-7-13-11(16)14-10(15)9-5-4-6-12-8-9/h4-6,8,13-14H,2-3,7H2,1H3
charge 0 multiplicity 1
31 atoms
O  -1.648175 1.522765 2.26214
O  0.006999 -1.542578 -0.13836
N  -2.148298 -0.462803 1.097734
N  0.067807 0.408318 1.149393
N  4.178279 0.951712 -0.033539
C  -4.45098 -0.010198 0.176672
C  -3.592611 -0.450129 1.386613
C  -4.359919 -0.964688 -1.035673
C  -5.253687 -0.515273 -2.211718
C  -1.323033 0.531813 1.545755
C  2.123882 -0.387983 0.047146
C  0.659382 -0.552814 0.338345
C  2.821083 -1.503124 -0.485237
C  2.848755 0.818741 0.239088
C  4.194201 -1.381412 -0.77323
C  4.832708 -0.143131 -0.523498
H  -4.150054 1.012214 -0.124989
H  -5.506122 0.053984 0.513121
H  -3.890699 -1.467611 1.707198
H  -3.750895 0.238269 2.234246
H  -4.651036 -1.987247 -0.717501
H  -3.308082 -1.028851 -1.379958
H  -4.962039 0.490731 -2.56762
H  -5.176879 -1.211695 -3.066562
H  -6.316435 -0.467757 -1.907439
H  -1.718054 -1.202256 0.519338
H  0.638689 1.153122 1.556609
H  2.267945 -2.43073 -0.662571
H  2.363749 1.736649 0.596106
H  4.763659 -2.221872 -1.180902
H  5.901661 -0.008567 -0.722504
