program: Gaussian 09
title: 000203129
version: EM64L-G09RevD.01
frameworkgroup: C1[X(C12H15NO5)]
method: RPBEPBE
basis: SDD
operation: Freq
keyword: #p
keyword: freq=noraman
keyword: PBEPBE/SDD
title: #p freq=noraman PBEPBE/SDD
converged: YES YES NO NO
title: Mulliken charges:
elementType: O O O O O N C C C C C C C C C C C C H H H H H H H H H H H H H H H
charge: -0.299738 -0.259048 -0.466941 -0.330621 -0.274573 -0.374811 -0.055940 -0.113738 -0.358010 -0.368051 0.245632 0.247661 -0.373147 -0.376813 -0.226827 -0.225159 0.316458 -0.604984 0.272795 0.247717 0.263599 0.217943 0.274460 0.240075 0.361194 0.251997 0.249010 0.228477 0.228329 0.326570 0.231132 0.232352 0.273001
chargesum: 0.00000
title: Mulliken charges with hydrogens summed into heavy atoms:
elementType: O O O O O N C C C C C C C C C C C C
charge: -0.299738 -0.259048 -0.105747 -0.330621 -0.274573 -0.048241 0.216855 0.133979 0.123532 0.146484 0.245632 0.247661 -0.121149 -0.127803 0.001650 0.003170 0.316458 0.131500
polarizability: 2.14697118e+02 1.41483143e+01 1.54349905e+02 9.10351945e+00 -7.16312051e+00 8.74212247e+01
1716.lowfreq: -14.6625 -9.3076 -0.6740 0.0007 0.0008 0.0009 18.8819 26.1736 33.0630
frequency: 18.5489 26.0325 32.9513 47.2953 64.9148 100.5577 124.6648 148.4178 154.9550 157.4238 210.0254 245.6150 253.9771 290.2277 299.0100 334.3744 379.3851 409.1266 448.4700 451.1999 467.1068 496.6206 509.6795 549.0367 572.9437 576.9565 589.6428 627.2162 684.5991 693.6767 711.8296 725.5581 754.7170 817.8671 841.8707 846.4291 849.1987 888.9654 932.9648 946.7492 966.2117 966.5045 979.6676 1021.0860 1035.1318 1069.3005 1081.6529 1089.8206 1095.0168 1126.1393 1126.6517 1145.5487 1160.8486 1163.6265 1198.0626 1206.6747 1230.8537 1237.0061 1252.3494 1265.9493 1297.0798 1311.5669 1323.7684 1352.6295 1369.9170 1391.9906 1402.1043 1430.6916 1442.2325 1443.6829 1459.8358 1462.1821 1473.7951 1484.0516 1516.2549 1591.0373 1611.9629 1694.9035 2981.5360 2982.6624 2994.0326 3010.2314 3042.1317 3061.6658 3115.5426 3120.7145 3127.5287 3137.4480 3151.1126 3163.4878 3175.4332 3556.4312 3576.3795
redmass: 5.3513 5.0799 4.5995 4.8480 5.4545 1.1173 4.4992 4.2224 3.3422 4.6764 3.5701 5.2672 4.7416 4.8461 5.7016 4.6490 3.1986 1.2409 3.3562 3.2602 3.4900 4.9451 5.2724 4.1310 6.5959 1.1280 3.6120 5.1797 4.5980 9.9738 4.3458 5.5080 1.2366 5.8308 3.4136 3.2093 1.5246 3.1781 1.3680 3.1766 1.2952 4.9153 4.8825 2.3271 2.5323 2.5431 2.5837 4.5842 2.8907 1.4039 1.5837 1.6640 1.1106 2.1204 2.0153 1.2616 1.1926 2.7995 1.2254 1.4528 1.3246 1.2538 1.2483 1.2989 1.8245 4.1723 1.5872 1.1605 1.1908 2.0775 1.2622 1.2526 2.4296 1.0445 1.4122 7.5224 7.0943 8.9753 1.0838 1.0354 1.0723 1.0798 1.0565 1.1028 1.0985 1.1087 1.0984 1.0852 1.0898 1.0947 1.1006 1.0655 1.0772
irintensity: 2.2930 0.3266 1.3889 5.3724 0.2563 0.0703 6.5625 6.4349 5.4637 0.1433 4.9054 7.4419 4.2094 2.2694 2.6868 37.9543 2.7640 103.2415 30.3899 5.3423 7.6673 2.1603 9.0445 1.5394 1.5784 151.0333 2.8904 12.8639 13.7322 21.3266 0.4258 24.4923 109.3400 26.4481 13.9270 12.0383 1.2306 38.9183 6.0290 48.9214 0.2328 74.8926 24.4654 7.9279 121.0917 12.2126 36.4886 249.8024 53.3036 10.1832 23.5007 24.6740 7.2846 18.9813 201.8909 41.9764 14.7287 254.7330 6.8698 2.1594 4.3126 13.6667 14.9861 2.1474 23.9879 12.5446 7.2982 31.2488 17.9681 2.6412 85.0677 87.0664 166.3394 16.2952 168.0525 22.8959 3.9224 263.5656 24.6136 76.1291 25.1163 46.2010 31.7598 35.9098 3.6930 4.5544 6.2407 1.4521 13.1591 13.7967 14.6365 12.7745 39.2601
temp: 298.150 k
press: 1.00000 atm
elementType: 8 8 8 8 8 7 6 6 6 6 6 6 6 6 6 6 6 6 1 1 1 1 1 1 1 1 1 1 1 1 1 1 1
symmnumber: 1
zpe: 681601.8 jmol-1
zpe.correction: 0.259608 hartree
zpe.thermalcorrener: 0.277100 hartree
zpe.thermalcorrenthalpy: 0.278044 hartree
zpe.thermalcorrgfe: 0.211466 hartree
zpe.sumelectzpe: -895.773784 hartree
zpe.sumelectthermal: -895.756292 hartree
zpe.sumelectthermalent: -895.755348 hartree
zpe.sumelectthermalfe: -895.821926 hartree
dipole: 4.4808 0.9453 -0.6914
dipole: 4.6313
quadrupole: -73.8163 -109.6137 -106.8187
quadrupole: 9.0022 1.0745 -2.4197
quadrupole: 22.9333 -12.8642 -10.0692 9.0022 1.0745 -2.4197
hfenergy: -896.033392 hartree
pointgroup: C01 [X(C12H15N1O5)]
dipole: -1.7347903 0.4264149 0.3587966 debye
polarizability: 213.512323|-17.4849975|153.8312617|4.6468279|13.7935396|89.1246628 unknown
InChI: InChI=1S/C12H15NO5/c1-13-12(15)17-6-8(14)11-7-16-9-4-2-3-5-10(9)18-11/h2-5,8,11,13-14H,6-7H2,1H3
charge 0 multiplicity 1
33 atoms
O  0.780657 -0.407693 -0.476045
O  2.660031 1.663567 0.376478
O  -1.367469 2.577238 -0.548185
O  -3.168029 0.758406 0.714049
O  -3.501448 -1.463907 -0.040062
N  -5.285071 0.03238 0.31181
C  0.459563 1.039555 -0.529712
C  -1.07277 1.137831 -0.47802
C  1.201047 1.773376 0.59704
C  -1.702281 0.509794 0.774433
C  2.163675 -0.668941 -0.314758
C  3.079265 0.343383 0.086104
C  2.621091 -1.977519 -0.567131
C  4.451871 0.043302 0.200936
C  3.994264 -2.278298 -0.437553
C  4.911034 -1.264946 -0.064064
C  -3.964907 -0.344976 0.288846
C  -6.363191 -0.884944 -0.069768
H  0.809485 1.445335 -1.499815
H  -1.483373 0.611836 -1.365051
H  0.968641 2.847538 0.581838
H  0.95654 1.339936 1.586393
H  -1.504698 -0.573951 0.814676
H  -1.376765 1.01556 1.697698
H  -2.345189 2.682778 -0.420628
H  1.892471 -2.736421 -0.869315
H  5.135995 0.841492 0.50578
H  4.346281 -3.296139 -0.634298
H  5.977975 -1.492893 0.027856
H  -5.50035 0.974227 0.639246
H  -6.954005 -0.478978 -0.911132
H  -7.040053 -1.085632 0.781133
H  -5.90489 -1.835294 -0.385579
