program: Gaussian 09
title: 000203190
version: EM64L-G09RevD.01
frameworkgroup: C1[X(C19H31N3O4)]
method: RPBEPBE
basis: SDD
operation: Freq
keyword: #p
keyword: freq=noraman
keyword: PBEPBE/SDD
title: #p freq=noraman PBEPBE/SDD
converged: YES YES NO NO
title: Mulliken charges:
elementType: O O O O N N N C C C C C C C C C C C C C C C C C C C H H H H H H H H H H H H H H H H H H H H H H H H H H H H H H H
charge: -0.267734 -0.247550 -0.416351 -0.351002 -0.094955 -0.179776 -0.450022 -0.369750 -0.384622 -0.319814 -0.293364 -0.478529 -0.330035 -0.318242 -0.680758 -0.694022 0.147969 -0.669141 -0.667320 0.556016 0.069020 0.245765 -0.612082 0.200673 -0.377177 -0.330174 0.222345 0.227332 0.220534 0.215321 0.225775 0.188576 0.236727 0.235981 0.245772 0.246666 0.203840 0.229894 0.200592 0.210271 0.221296 0.221934 0.216644 0.214065 0.212465 0.227343 0.221605 0.211541 0.222914 0.224594 0.214704 0.218240 0.364724 0.253553 0.306633 0.265674 0.385422
chargesum: 0.00000
title: Mulliken charges with hydrogens summed into heavy atoms:
elementType: O O O O N N N C C C C C C C C C C C C C C C C C C C
charge: -0.267734 -0.247550 -0.030929 -0.351002 -0.094955 -0.179776 -0.085297 0.079927 0.051233 0.094537 0.179344 0.013909 0.103699 0.092621 -0.020884 -0.040150 0.147969 -0.013082 -0.009781 0.556016 0.069020 0.245765 -0.358529 0.200673 -0.070544 -0.064500
polarizability: 4.02094642e+02 -2.03772108e+01 2.34943980e+02 9.57653167e+00 1.48190357e+01 1.80068872e+02
1716.lowfreq: -10.2977 -4.9580 -2.1737 -0.0021 -0.0006 0.0009 7.1306 12.6950 14.6500
frequency: -4.6337 12.5582 14.3879 28.6650 33.1764 40.1370 41.8767 54.7953 72.1161 74.8136 82.6588 91.3468 94.2569 108.2327 116.0827 152.3625 162.2359 176.4222 204.9353 212.2350 216.3878 234.5160 244.0677 265.6720 270.1329 276.9249 283.7092 286.5071 291.5247 315.9155 332.8511 354.1613 383.3194 399.4190 402.4736 433.2508 446.2459 455.9102 489.2305 495.5563 512.0935 527.8806 562.9799 571.3787 581.2581 629.5317 676.5461 682.9581 740.3444 747.0119 749.9022 752.7937 770.2495 788.3873 796.4538 798.8267 806.8627 813.7051 851.4314 863.1483 872.3535 877.6241 891.6531 896.3991 909.9300 934.3437 973.8538 979.9557 987.9534 994.5898 996.8761 1033.9887 1054.7248 1060.7220 1065.8583 1066.8276 1074.4318 1078.7505 1088.4249 1088.5531 1110.3690 1115.8584 1142.1166 1157.0783 1169.3229 1184.4805 1195.9096 1202.0777 1203.5635 1227.9130 1248.6401 1250.3943 1275.7998 1281.2071 1281.9005 1288.8964 1298.3309 1311.4036 1324.5803 1329.4111 1335.1324 1340.3294 1357.8968 1363.6935 1371.5611 1373.3844 1376.2374 1383.6228 1387.6114 1391.8289 1392.9215 1393.2504 1426.3623 1447.1777 1449.3588 1457.3395 1466.6441 1467.8340 1468.3891 1472.7510 1475.5158 1477.3641 1478.6133 1480.6996 1483.4992 1487.2466 1488.5992 1492.3577 1498.5245 1506.3299 1564.5703 1575.5972 1626.6605 1655.1988 2871.6624 2895.2442 2901.6567 2921.0896 2959.2874 2970.8311 2977.6521 2982.7981 2985.5880 2986.8079 2991.1190 3022.9575 3027.0319 3039.6162 3045.0922 3047.3355 3049.3876 3049.5123 3072.8192 3076.1566 3080.3505 3081.5586 3083.5779 3087.2882 3088.5225 3091.0570 3133.3128 3152.9800 3166.3363 3197.0578 3225.7426
redmass: 3.6632 4.5369 3.6872 3.7683 3.5575 2.7191 3.5772 3.6214 3.5026 3.6689 3.8111 2.4256 2.5231 4.2635 2.8325 7.1444 1.7085 1.9311 1.7920 1.1204 1.4967 3.1770 4.2358 2.7346 1.7780 2.2857 3.8258 2.5741 2.6207 3.5164 3.5351 4.7536 4.1302 3.5100 2.3379 6.2140 2.6901 3.0035 2.8680 3.4173 4.3852 3.9463 4.8913 4.4982 4.3578 7.2746 5.5573 3.5669 2.6202 3.2764 3.2694 2.7687 1.1389 2.0720 1.1500 1.2233 1.6858 1.6377 1.5123 1.2785 1.3442 4.4754 1.8956 2.2184 5.1021 1.2296 2.4623 2.7882 2.0131 1.3146 2.4191 3.0676 3.4637 2.6454 2.5995 2.0824 1.9095 2.3250 2.1697 2.1858 1.9496 1.6624 1.6249 1.8656 2.4631 1.7613 1.6261 2.2172 2.0677 1.8563 1.3535 1.4328 1.8208 1.1862 1.2752 1.1874 1.1830 2.4877 1.3251 1.3930 1.3370 1.2294 1.9707 1.3601 1.3632 1.3090 1.3563 1.6143 1.4101 1.3495 1.7664 1.5101 3.0341 1.0842 1.2447 1.0644 1.0583 1.0493 1.0734 1.0510 1.0659 1.0608 1.0638 1.0493 1.0828 1.4574 1.0781 1.5222 1.0831 2.4002 5.5542 3.6986 6.9428 5.2583 1.0715 1.0715 1.0703 1.0688 1.0661 1.0690 1.0351 1.0368 1.0360 1.0359 1.0608 1.0877 1.0905 1.0988 1.0848 1.0907 1.0679 1.0920 1.0990 1.0988 1.0984 1.1009 1.0982 1.1005 1.1004 1.1005 1.1089 1.0921 1.0900 1.0960 1.0770
irintensity: 0.0979 0.8337 0.3027 0.0317 0.3661 0.1046 0.6357 1.4507 1.6176 3.3030 1.0549 2.7733 0.3435 0.2722 0.7538 0.0276 2.4545 0.6014 3.2236 0.3789 3.1103 0.4875 1.3839 15.8740 0.6391 2.0340 4.0645 1.0428 3.9006 1.2442 3.4021 29.0842 6.8475 0.6511 3.7419 37.1266 2.6485 6.3000 12.3751 13.8854 2.1642 2.5897 0.8290 3.8534 22.4879 0.2514 15.0875 19.2423 4.2248 1.3360 2.2704 29.2751 5.2416 1.8176 2.9245 6.4347 4.1076 3.9910 0.5471 176.5082 11.8171 35.7078 15.4713 6.0911 38.2241 65.1632 8.6575 15.4336 19.3766 0.5445 8.5066 31.6862 260.1532 83.3408 13.1009 40.0786 22.9138 15.7955 42.1451 46.3580 19.6423 4.4830 112.1341 21.9362 6.5033 19.4731 95.5155 21.3645 38.4302 66.1041 21.0474 39.1666 322.6802 28.6032 47.4210 21.3769 13.6582 12.9637 12.5944 3.4085 2.6919 12.1091 633.4094 41.1447 8.0581 26.8356 104.2814 85.4612 16.4708 19.8539 40.4192 41.5910 117.5331 3.9050 7.8406 15.7274 19.5114 13.1143 12.5260 4.7313 34.2048 6.0404 18.5084 4.0700 33.2420 63.1551 17.4243 79.1273 3.5769 537.3675 67.8743 180.9508 313.8672 399.2715 77.1152 35.6067 177.0918 61.5529 53.5258 403.0155 27.3575 24.4991 22.9963 17.9393 46.6836 12.1278 12.5585 14.7263 18.4896 3.4331 28.1254 17.4276 42.3078 73.9048 37.9785 47.1669 51.6458 69.9292 43.3275 37.9335 12.6113 6.4378 1.9920 4.6875 476.6371
temp: 298.150 k
press: 1.00000 atm
elementType: 8 8 8 8 7 7 7 6 6 6 6 6 6 6 6 6 6 6 6 6 6 6 6 6 6 6 1 1 1 1 1 1 1 1 1 1 1 1 1 1 1 1 1 1 1 1 1 1 1 1 1 1 1 1 1 1 1
symmnumber: 1
zpe: 1262523.3 jmol-1
zpe.correction: 0.480870 hartree
zpe.thermalcorrener: 0.509214 hartree
zpe.thermalcorrenthalpy: 0.510158 hartree
zpe.thermalcorrgfe: 0.418025 hartree
zpe.sumelectzpe: -1205.752306 hartree
zpe.sumelectthermal: -1205.723962 hartree
zpe.sumelectthermalent: -1205.723018 hartree
zpe.sumelectthermalfe: -1205.815151 hartree
dipole: 2.4755 0.5866 1.6429
dipole: 3.0284
quadrupole: -102.3728 -169.6644 -158.3063
quadrupole: 16.0545 3.5046 -4.9226
quadrupole: 41.0750 -26.2166 -14.8584 16.0545 3.5046 -4.9226
hfenergy: -1206.233176 hartree
pointgroup: C01 [X(C19H31N3O4)]
dipole: 1.0123822 -0.4558261 0.432318 debye
polarizability: 402.8676258|-0.5271786|175.9514157|-17.9635232|5.8360543|238.2884523 unknown
InChI: InChI=1S/C19H31N3O4/c1-5-21(6-2)11-12-26-19(25)16-10-9-15(13-17(16)23)20-18(24)14-22(7-3)8-4/h9-10,13,20,23H,5-8,11-12,14H2,1-4H3
charge 0 multiplicity 1
57 atoms
O  -2.881856 0.521855 -0.869648
O  3.907857 -0.011297 -2.8940
O  -0.218967 0.199795 2.427857
O  -2.594195 0.424232 1.442101
N  -6.386993 -0.752285 -0.229719
N  6.125578 -0.044462 0.063497
N  3.54378 -0.068236 -0.550106
C  -4.952099 -0.84301 -0.578163
C  -7.273307 -1.652948 -1.006973
C  -6.625162 -0.715537 1.237086
C  -4.361216 0.580126 -0.651033
C  5.817123 -0.300591 -1.367927
C  6.444964 1.399214 0.30432
C  7.141051 -0.981017 0.632547
C  -7.123512 -3.173302 -0.724042
C  -8.012277 -0.164638 1.614912
C  4.31863 -0.097922 -1.699787
C  6.23945 1.834756 1.766158
C  6.585248 -2.397561 0.865505
C  2.147274 0.058696 -0.40664
C  -0.655501 0.301165 0.000741
C  -2.09135 0.415056 0.259758
C  1.62593 0.073335 0.90945
C  0.237966 0.192687 1.125344
C  1.271018 0.166819 -1.533189
C  -0.105303 0.284946 -1.31179
H  -4.838669 -1.332041 -1.562661
H  -4.366589 -1.442261 0.155679
H  -8.320287 -1.34806 -0.824451
H  -7.080357 -1.462102 -2.080129
H  -5.849158 -0.062834 1.678623
H  -6.482187 -1.72088 1.706206
H  -4.564573 1.138676 0.27776
H  -4.747142 1.128529 -1.522855
H  6.400048 0.338761 -2.064494
H  6.058925 -1.34843 -1.623956
H  7.48674 1.631149 -0.023004
H  5.77028 1.993494 -0.340124
H  8.046803 -1.026853 -0.018513
H  7.469461 -0.566114 1.601544
H  -7.372183 -3.420817 0.3239
H  -6.091342 -3.5178 -0.920889
H  -7.803778 -3.751576 -1.376832
H  -8.09317 -0.061729 2.712651
H  -8.829834 -0.830267 1.283631
H  -8.168237 0.827696 1.155894
H  5.198741 1.647176 2.08552
H  6.912897 1.3051 2.463191
H  6.441433 2.916519 1.868339
H  5.730151 -2.368103 1.563421
H  6.243745 -2.872684 -0.07201
H  7.367949 -3.046622 1.299168
H  4.155051 -0.14281 0.290704
H  2.280276 -0.010693 1.783235
H  1.691092 0.15431 -2.539992
H  -0.791565 0.367366 -2.15957
H  -1.238554 0.289425 2.396156
