program: Gaussian 09
title: 000203146
version: EM64L-G09RevD.01
frameworkgroup: C1[X(C16H24N2O4)]
method: RPBEPBE
basis: SDD
operation: Freq
keyword: #p
keyword: freq=noraman
keyword: PBEPBE/SDD
title: #p freq=noraman PBEPBE/SDD
converged: YES YES NO NO
title: Mulliken charges:
elementType: O O O O N N C C C C C C C C C C C C C C C C H H H H H H H H H H H H H H H H H H H H H H H H
charge: -0.247296 -0.274761 -0.416764 -0.344927 -0.179794 -0.449775 -0.476344 -0.316400 -0.327825 0.146565 -0.667939 -0.670664 0.556258 -0.613624 0.066798 -0.377129 0.202648 -0.328576 -0.220946 -0.382293 0.239111 -0.678022 0.244413 0.245973 0.199739 0.209956 0.202924 0.229933 0.224794 0.214216 0.218499 0.222069 0.211562 0.222848 0.363958 0.254002 0.306699 0.264661 0.224883 0.225256 0.217831 0.217722 0.213272 0.213283 0.227129 0.386077
chargesum: 0.00000
title: Mulliken charges with hydrogens summed into heavy atoms:
elementType: O O O O N N C C C C C C C C C C C C C C C C
charge: -0.247296 -0.274761 -0.030687 -0.344927 -0.179794 -0.085817 0.014042 0.093295 0.105032 0.146565 -0.010430 -0.014186 0.556258 -0.359623 0.066798 -0.070430 0.202648 -0.063915 0.229192 0.053260 0.239111 -0.024338
polarizability: 3.38417515e+02 1.74250734e+01 2.06758065e+02 2.35682494e+00 -3.81810212e+00 1.34678980e+02
1716.lowfreq: -9.0622 0.0006 0.0006 0.0008 3.0986 6.8073 14.2224 27.0829 36.2055
frequency: 8.9803 26.4314 36.0888 41.2843 46.7473 56.9144 65.3443 78.4799 89.2019 96.2068 104.3722 135.0899 146.7248 175.6569 192.5313 209.3075 224.3825 230.5319 243.2221 249.8185 271.8369 287.6986 294.3042 317.8397 328.8543 353.1597 400.0848 401.6612 445.7859 456.2254 462.6415 511.7730 516.2851 565.3252 572.6549 576.1511 630.3845 679.8161 684.3057 748.5869 752.9464 756.1906 783.5566 794.0310 798.7421 811.8645 851.5351 861.4737 871.4703 876.9000 877.3755 893.6359 898.0256 934.4957 937.8232 980.9041 989.6937 995.4871 997.4889 1049.8678 1064.6898 1070.3424 1074.1980 1090.1278 1111.6723 1135.6951 1142.2016 1143.1859 1156.7949 1173.3043 1197.1711 1202.8934 1226.4973 1231.0363 1247.2077 1272.8265 1277.9698 1281.3177 1288.9077 1308.8149 1312.8068 1329.2607 1353.0126 1365.4402 1372.0488 1379.6194 1392.3047 1393.1711 1398.0175 1398.5171 1432.4292 1449.3174 1468.6190 1469.8383 1469.9333 1474.9864 1477.8679 1479.6496 1481.1205 1484.1155 1488.7820 1490.3001 1493.7169 1506.7855 1565.5438 1576.8177 1627.3173 1655.7953 2894.4781 2900.3881 2957.4394 2975.0639 2980.7087 2986.4632 2988.3566 2999.5636 3006.7412 3028.0345 3045.3914 3047.8485 3050.5208 3068.0290 3081.5222 3084.8924 3085.4710 3087.6783 3088.4104 3091.7098 3154.3225 3165.5176 3197.8861 3233.4254
redmass: 3.4008 2.9304 4.0157 3.4536 2.5092 3.6348 2.9313 3.7785 2.4586 2.2850 4.9858 4.3383 4.2829 4.1331 1.9840 1.4750 1.1426 2.5648 4.4491 2.9941 2.8729 4.2240 2.2774 5.4109 2.6958 4.8247 4.6516 3.8349 2.7821 3.0333 5.0900 4.8409 4.3999 4.5783 4.5869 4.8907 7.1631 5.8693 3.5660 2.9975 2.7240 1.1245 4.6307 1.9985 1.2518 2.0916 1.5119 1.2038 1.3908 2.0580 1.4989 1.8728 3.2652 1.2825 2.7007 2.8471 1.9966 1.3063 2.4409 2.9823 2.9096 4.5960 1.9239 2.1597 1.9228 2.1867 1.4605 1.6252 1.8156 2.4883 1.7961 2.0518 1.2652 1.8913 1.3786 1.9575 1.1014 1.1984 1.1865 1.5267 2.2767 1.4016 1.7862 1.3284 1.4056 2.2569 2.1736 1.3564 1.4593 1.2713 4.2818 1.0838 1.0724 1.0779 1.0551 1.0632 1.0628 1.0561 1.0433 1.0777 1.3550 1.0944 1.6865 2.4022 5.8380 3.6945 6.7275 5.2475 1.0715 1.0706 1.0663 1.0690 1.0362 1.0359 1.0361 1.0601 1.0571 1.0903 1.1016 1.0928 1.0900 1.1043 1.0982 1.0983 1.0991 1.1055 1.1004 1.1005 1.0921 1.0902 1.0959 1.0769
irintensity: 0.8394 0.2899 0.2759 1.0216 0.6508 0.7171 1.4645 3.0992 2.6581 0.7109 0.2258 3.4835 2.3767 3.5833 2.6065 0.2547 0.3319 2.0512 0.2163 0.3540 10.0303 1.2028 2.8911 0.4148 1.3597 19.9804 28.7374 11.9328 4.1714 6.1540 9.8831 3.2476 9.4017 3.6243 10.2418 2.0133 0.1176 15.9867 16.3756 0.8623 23.6485 4.6825 2.6903 5.7110 2.9130 1.3830 2.4417 189.4082 2.2406 10.1852 6.6706 9.9940 1.1180 75.1676 47.7615 16.2257 18.9153 1.2012 7.9823 61.2951 139.3578 184.8202 8.0671 7.5445 21.3629 1.2426 4.3025 128.9783 20.0778 2.9222 94.9219 29.3118 0.9083 103.0278 23.4793 422.2436 0.1059 1.8691 21.0808 57.4018 9.8303 5.3594 533.0128 2.4425 30.4252 231.6286 52.0033 29.7008 11.3815 24.3340 83.7575 2.5631 30.0209 3.2270 1.9466 31.2812 3.9847 12.5155 13.3180 27.1751 58.3864 24.1344 71.1012 540.5226 77.3795 191.1404 297.6007 372.7004 25.5555 181.1094 52.5041 367.6851 24.2010 22.6965 18.6665 1.7666 45.9340 12.7483 0.3075 5.4543 11.8270 1.0867 40.4835 46.4897 38.9220 89.3046 71.0406 36.3321 6.1228 2.0978 4.7231 448.4136
temp: 298.150 k
press: 1.00000 atm
elementType: 8 8 8 8 7 7 6 6 6 6 6 6 6 6 6 6 6 6 6 6 6 6 1 1 1 1 1 1 1 1 1 1 1 1 1 1 1 1 1 1 1 1 1 1 1 1
symmnumber: 1
zpe: 1001035.4 jmol-1
zpe.correction: 0.381274 hartree
zpe.thermalcorrener: 0.405192 hartree
zpe.thermalcorrenthalpy: 0.406136 hartree
zpe.thermalcorrgfe: 0.324246 hartree
zpe.sumelectzpe: -1032.839905 hartree
zpe.sumelectthermal: -1032.815988 hartree
zpe.sumelectthermalent: -1032.815044 hartree
zpe.sumelectthermalfe: -1032.896933 hartree
dipole: -2.5591 0.2261 0.3480
dipole: 2.5925
quadrupole: -82.0476 -149.9500 -130.5710
quadrupole: -13.9912 0.8674 1.7734
quadrupole: 38.8086 -29.0938 -9.7148 -13.9912 0.8674 1.7734
hfenergy: -1033.2211795 hartree
pointgroup: C01 [X(C16H24N2O4)]
dipole: 0.9841697 0.2660809 0.0308325 debye
polarizability: 337.3807953|13.976761|140.2872875|-19.0971106|16.6654807|202.1864776 unknown
InChI: InChI=1S/C16H24N2O4/c1-4-9-22-16(21)13-8-7-12(10-14(13)19)17-15(20)11-18(5-2)6-3/h7-8,10,17,19H,4-6,9,11H2,1-3H3
charge 0 multiplicity 1
46 atoms
O  2.448577 -0.82436 -2.686655
O  -4.17464 -0.813416 -0.120851
O  -1.282718 0.166815 2.833987
O  -3.725354 -0.237759 2.088215
N  4.827975 0.328174 -0.106507
N  2.260103 -0.294572 -0.381736
C  4.477167 -0.380424 -1.365618
C  6.051186 -0.212905 0.559514
C  4.869341 1.811399 -0.312655
C  2.948469 -0.514478 -1.565716
C  5.814615 -1.57977 1.227163
C  4.709992 2.615869 0.989658
C  0.87624 -0.355901 -0.118838
C  0.450248 -0.07314 1.201201
C  -1.89078 -0.450472 0.523409
C  -0.078458 -0.688714 -1.131788
C  -0.919291 -0.117038 1.532967
C  -1.435823 -0.729873 -0.795793
C  -5.627511 -0.861634 0.230148
C  -6.381093 -1.223826 -1.049665
C  -3.304005 -0.487064 0.901654
C  -7.903118 -1.305939 -0.79592
H  4.888787 0.106704 -2.275252
H  4.884968 -1.407547 -1.343118
H  6.899085 -0.280739 -0.163678
H  6.355415 0.511094 1.335568
H  5.810712 2.108917 -0.834114
H  4.035585 2.068504 -0.992643
H  5.019635 -1.505516 1.989831
H  5.517232 -2.356048 0.498999
H  6.740775 -1.927184 1.720535
H  3.758756 2.363409 1.491362
H  5.53312 2.431273 1.702439
H  4.703407 3.697819 0.764432
H  2.927394 -0.035743 0.375154
H  1.165902 0.180778 1.989866
H  0.269552 -0.903169 -2.143238
H  -2.180658 -0.982163 -1.556183
H  -5.769126 -1.613285 1.028553
H  -5.924748 0.125994 0.628301
H  -6.005164 -2.191862 -1.430042
H  -6.163998 -0.465649 -1.824984
H  -8.144561 -2.07485 -0.03841
H  -8.304949 -0.339918 -0.437351
H  -8.439326 -1.569052 -1.724517
H  -2.301713 0.088658 2.894414
