program: Gaussian 09
title: 000203103
version: EM64L-G09RevD.01
frameworkgroup: C1[X(C14H19NO5)]
method: RPBEPBE
basis: SDD
operation: Freq
keyword: #p
keyword: freq=noraman
keyword: PBEPBE/SDD
title: #p freq=noraman PBEPBE/SDD
converged: YES YES NO NO
title: Mulliken charges:
elementType: O O O O O N C C C C C C C C C C C C C C H H H H H H H H H H H H H H H H H H H
charge: -0.299816 -0.259177 -0.468945 -0.330913 -0.272429 -0.380181 -0.057966 -0.115955 -0.356990 -0.370369 0.245962 0.248175 -0.373335 -0.377094 -0.038722 0.293507 -0.227015 -0.225277 -0.703808 -0.660575 0.272569 0.251696 0.264509 0.217094 0.271714 0.239400 0.361748 0.251647 0.244115 0.248877 0.318454 0.228264 0.228166 0.227631 0.205281 0.233876 0.250999 0.213062 0.201817
chargesum: 0.00000
title: Mulliken charges with hydrogens summed into heavy atoms:
elementType: O O O O O N C C C C C C C C C C C C C C
charge: -0.299816 -0.259177 -0.107196 -0.330913 -0.272429 -0.061727 0.214604 0.135742 0.124614 0.140745 0.245962 0.248175 -0.121688 -0.128217 0.205393 0.293507 0.001249 0.002889 -0.037020 0.005304
polarizability: 2.42074220e+02 -1.61224151e+01 1.74978785e+02 -8.38467203e+00 -8.66705216e+00 1.08460825e+02
1716.lowfreq: -19.0330 -11.4044 -5.0073 -0.0009 -0.0008 -0.0008 1.9277 18.5964 22.7079
frequency: -15.7625 18.5117 22.3290 36.3151 51.6721 59.4089 95.4796 113.9878 137.8797 155.7324 162.5665 215.4443 236.4411 240.2584 255.1084 284.4105 290.4760 301.1121 337.4350 378.0588 392.0274 409.4663 434.9501 450.1539 460.3305 470.7904 497.5772 510.0180 540.7374 548.9852 572.2258 587.5276 643.2799 681.9355 697.1839 711.6189 725.5092 754.5865 818.2187 832.8862 844.4096 848.1812 872.3073 889.7543 919.3824 932.3320 934.5618 949.8546 957.7131 965.8921 978.9053 1018.8360 1025.0064 1035.7746 1069.5420 1082.2364 1093.7780 1125.7930 1140.2825 1148.6988 1160.8829 1163.9189 1183.5425 1201.0657 1207.5103 1230.1255 1237.1558 1253.5456 1265.9343 1296.5910 1309.7372 1313.7199 1323.6129 1349.1753 1353.9791 1369.6624 1380.0905 1392.2328 1397.6237 1401.9426 1440.1508 1443.5101 1460.3691 1461.8567 1466.4843 1468.6372 1474.7685 1485.4964 1487.5340 1591.1243 1612.4953 1681.5190 2977.7372 2982.8248 2983.1339 2994.5616 3010.5688 3022.0411 3043.3605 3072.0305 3083.6030 3094.7759 3097.6017 3122.0959 3129.7110 3136.8864 3150.3256 3162.6276 3174.7835 3551.8125 3556.8249
redmass: 3.0391 4.7475 4.6548 5.1360 6.2456 5.4361 4.3472 5.2256 3.2782 4.6612 3.9714 1.0291 6.1309 4.1149 1.1278 3.4937 4.9977 5.7843 2.9303 3.1551 2.7933 1.3788 2.2623 3.1515 4.3103 2.8601 4.6925 4.4109 1.1802 4.1226 6.8148 3.6043 5.4405 4.4563 10.7205 4.3348 5.5925 1.2376 5.9257 3.0571 3.1366 1.4365 3.5018 3.2912 1.2597 1.3775 2.0613 1.7320 2.6521 1.2931 5.0253 2.9231 2.7846 2.6574 2.5582 2.5517 2.7063 1.7851 2.1309 2.0915 1.0927 2.1980 2.1690 1.9910 1.2810 1.1971 2.8266 1.2168 1.4508 1.3189 1.3405 1.3786 1.2721 1.2569 1.2843 1.8010 1.2163 4.2408 1.2341 1.5823 1.1246 2.3299 1.2435 1.1468 1.1452 1.1589 2.4394 1.1724 1.0927 7.5173 7.1129 10.0302 1.0380 1.0827 1.0374 1.0725 1.0799 1.0850 1.0565 1.0981 1.0991 1.1002 1.0999 1.1087 1.0981 1.0852 1.0898 1.0947 1.1007 1.0654 1.0773
irintensity: 0.6434 0.1604 0.0294 0.8902 6.9972 0.5424 1.9297 1.8128 6.7060 1.3517 4.9688 0.0426 9.3628 7.6012 0.3643 11.2327 3.3434 6.7658 12.1394 1.3400 15.3190 79.3080 34.1327 3.8239 4.1500 9.7501 2.0129 9.0487 124.6023 1.3789 1.3232 3.5228 16.2093 10.5862 20.5913 0.4269 22.7074 108.9630 29.0055 1.4617 7.4834 0.3248 26.3108 36.0503 7.3147 7.0066 17.3501 14.8947 8.7857 0.0328 63.5389 115.8225 142.6004 185.3357 16.4475 5.6529 3.1714 68.2214 23.2515 29.7377 7.2741 17.9038 1.5388 208.4961 51.3151 11.1912 262.9335 7.1140 3.0498 4.8419 34.5107 2.6802 11.7797 8.2117 2.1918 21.4812 25.2379 16.0727 37.8973 9.5863 18.3110 3.7298 138.1566 47.1284 103.6086 95.4682 146.7585 89.9603 17.1010 23.2494 4.0371 261.6219 22.9870 22.2213 25.5173 25.2033 46.7844 2.7489 32.3191 13.7426 57.9702 17.7888 40.5172 4.7536 5.9721 1.3632 13.0304 14.0642 15.1981 13.9800 34.2759
temp: 298.150 k
press: 1.00000 atm
elementType: 8 8 8 8 8 7 6 6 6 6 6 6 6 6 6 6 6 6 6 6 1 1 1 1 1 1 1 1 1 1 1 1 1 1 1 1 1 1 1
symmnumber: 1
zpe: 826495.0 jmol-1
zpe.correction: 0.314795 hartree
zpe.thermalcorrener: 0.334089 hartree
zpe.thermalcorrenthalpy: 0.335033 hartree
zpe.thermalcorrgfe: 0.264977 hartree
zpe.sumelectzpe: -974.227081 hartree
zpe.sumelectthermal: -974.207788 hartree
zpe.sumelectthermalent: -974.206843 hartree
zpe.sumelectthermalfe: -974.276899 hartree
dipole: 4.7228 -0.9200 0.9538
dipole: 4.9052
quadrupole: -92.1321 -121.1069 -119.3557
quadrupole: -9.5767 -0.8234 -2.0350
quadrupole: 18.7328 -10.2420 -8.4908 -9.5767 -0.8234 -2.0350
hfenergy: -974.5418768 hartree
pointgroup: C01 [X(C14H19N1O5)]
dipole: -1.8328376 0.3643009 0.4820445 debye
polarizability: 241.174047|-18.8539131|172.3225422|2.4429481|18.182979|112.0172413 unknown
InChI: InChI=1S/C14H19NO5/c1-9(2)15-14(17)19-7-10(16)13-8-18-11-5-3-4-6-12(11)20-13/h3-6,9-10,13,15-16H,7-8H2,1-2H3
charge 0 multiplicity 1
39 atoms
O  1.480227 -0.362476 -0.499308
O  3.451578 1.548756 0.505788
O  -0.53765 2.704903 -0.250544
O  -2.40325 0.868731 0.852157
O  -2.869873 -1.142893 -0.313332
N  -4.563327 0.348955 0.344709
C  1.218933 1.096256 -0.423351
C  -0.30719 1.254838 -0.343564
C  2.000434 1.698105 0.753547
C  -0.95635 0.521708 0.84089
C  2.853735 -0.690074 -0.386312
C  3.813855 0.245897 0.089246
C  3.256212 -1.986502 -0.764325
C  5.175033 -0.115246 0.152311
C  -5.704922 -0.447509 -0.166776
C  -3.268643 -0.085483 0.235447
C  4.61812 -2.349862 -0.686164
C  5.578952 -1.410294 -0.238096
C  -6.87978 0.499824 -0.477777
C  -6.098112 -1.564291 0.828819
H  1.578501 1.569913 -1.358521
H  -0.748333 0.849732 -1.277856
H  1.813172 2.778008 0.834354
H  1.746946 1.190978 1.704846
H  -0.829713 -0.568939 0.744826
H  -0.582938 0.889862 1.809855
H  -1.505833 2.835851 -0.079226
H  2.494442 -2.686162 -1.122699
H  -5.355904 -0.9241 -1.101564
H  5.894184 0.625291 0.516375
H  -4.741455 1.200348 0.880084
H  4.927003 -3.357874 -0.981388
H  6.637345 -1.685758 -0.185809
H  -7.727645 -0.072213 -0.892405
H  -7.237571 1.005183 0.440518
H  -6.589447 1.270822 -1.213287
H  -5.233632 -2.219565 1.031153
H  -6.91044 -2.185068 0.408813
H  -6.449664 -1.134653 1.785267
