program: Gaussian 09
title: 000203123
version: EM64L-G09RevD.01
frameworkgroup: C1[X(C19H21ClN2S)]
method: RPBEPBE
basis: SDD
operation: Freq
keyword: #p
keyword: freq=noraman
keyword: PBEPBE/SDD
title: #p freq=noraman PBEPBE/SDD
converged: YES YES NO NO
title: Mulliken charges:
elementType: Cl S N N C C C C C C C C C C C C C C C C C C C H H H H H H H H H H H H H H H H H H H H H
charge: -0.038849 0.238399 -0.113915 -0.060096 -0.165921 -0.364103 -0.356254 -0.371172 -0.395606 -0.638740 0.533331 0.589322 -0.386753 -0.614095 -0.338825 -0.351711 -0.427678 -0.251409 -0.261095 -0.129507 -0.239508 -0.227424 -0.251930 0.220011 0.185196 0.200080 0.232243 0.218273 0.179431 0.203670 0.209191 0.194018 0.212373 0.239484 0.224105 0.221199 0.185555 0.238987 0.248781 0.256478 0.231142 0.233571 0.233114 0.256636
chargesum: 0.00000
title: Mulliken charges with hydrogens summed into heavy atoms:
elementType: Cl S N N C C C C C C C C C C C C C C C C C C C
charge: -0.038849 0.238399 -0.113915 -0.060096 0.054089 0.021172 0.094262 0.011929 0.007603 -0.186883 0.533331 0.589322 -0.386753 0.016764 -0.338825 -0.112724 -0.178896 0.005069 -0.029953 -0.129507 -0.005936 0.005691 0.004707
polarizability: 2.64464197e+02 5.45596612e-01 2.81821607e+02 -2.90511800e+01 -1.27494034e+01 1.74598763e+02
1716.lowfreq: -11.3009 -8.8658 -5.7303 -0.0017 -0.0016 0.0007 14.7051 38.3043 49.4418
frequency: 13.7387 38.2554 49.4343 59.0913 68.7231 90.3664 134.4109 156.3164 170.7130 189.6775 203.0301 223.8618 232.0625 244.4382 270.9631 289.8302 296.8550 314.5390 323.2891 353.5502 367.1708 377.0270 413.7502 419.0727 423.4540 456.7791 479.4285 486.0131 498.3573 521.9269 529.9549 545.2101 584.5919 613.2023 645.3600 682.2941 711.8240 713.1351 735.2424 749.2311 752.5850 768.9644 783.3779 797.9042 850.2499 860.1091 874.4618 899.9309 937.1387 947.5987 954.4760 968.6146 975.0991 985.7434 1009.6470 1015.2249 1024.9986 1029.2849 1049.2350 1055.1245 1070.1862 1074.1460 1092.0105 1105.9053 1118.9493 1137.4257 1141.6460 1146.3133 1148.0045 1168.8132 1176.1930 1180.9292 1193.7752 1207.9764 1229.3197 1244.4581 1249.8411 1278.7200 1283.1155 1285.9051 1311.3048 1321.3166 1338.7457 1349.3174 1362.1138 1367.6562 1369.1288 1371.1485 1374.3105 1411.3960 1415.6411 1428.9475 1437.6633 1447.7735 1452.1694 1453.7198 1460.4002 1461.4991 1467.3552 1473.9954 1481.0747 1562.8283 1570.4878 1587.2314 1596.7172 2840.2197 2848.0670 2863.3510 2871.7644 2903.5765 2973.2117 2985.7931 3016.1300 3020.5674 3027.1378 3029.7205 3056.7922 3068.3975 3074.5668 3126.1237 3136.1632 3138.1060 3148.4913 3157.2632 3166.2411 3174.2558
redmass: 6.3097 5.8751 5.6239 3.2539 4.2404 4.1344 4.2901 4.2030 8.9265 4.3179 4.5003 3.0790 1.3346 4.5029 2.1984 4.9269 2.6491 3.2252 3.4443 2.7123 4.0677 4.6427 2.5837 3.1164 6.4636 3.6729 2.8683 4.4656 5.0569 3.7929 4.4078 5.6841 3.9075 2.7045 5.8883 4.1366 5.8601 4.3711 2.7829 2.3651 2.0166 1.9672 1.8677 4.1454 1.5555 2.3430 1.5393 1.6567 2.0081 2.1653 1.4804 1.3823 2.8608 1.3317 2.4253 5.8093 4.0725 3.9311 1.6091 2.2255 1.6868 1.9352 1.9951 1.6375 1.8306 1.9132 2.8263 2.4860 2.5295 1.6878 1.1002 1.2845 1.1431 1.6577 1.3012 1.9690 1.4467 1.7711 1.4812 1.5394 1.3668 1.3779 1.3902 1.6825 1.3949 4.6192 2.9824 1.6516 1.4562 2.3606 2.0269 1.1705 2.3197 1.2219 1.0885 1.0827 1.0651 2.0808 1.1317 1.1044 1.0533 6.5643 6.4377 6.9752 6.1019 1.0681 1.0637 1.0647 1.0676 1.0697 1.0743 1.0721 1.0727 1.0891 1.0900 1.0890 1.0983 1.0896 1.1010 1.0852 1.0885 1.0867 1.0944 1.0933 1.1011 1.0985
irintensity: 0.4593 0.0333 0.5599 0.3805 0.2610 0.9703 0.5068 0.1770 1.4752 0.9115 0.2589 0.7709 0.3328 0.8009 1.4354 4.0113 4.2520 5.7172 3.8413 0.1677 4.5657 3.4124 0.6336 3.4432 0.9627 1.4703 0.1381 1.8757 4.6133 2.4002 9.5571 1.6937 2.5240 5.4763 6.1377 0.4209 11.7373 10.8417 25.8665 6.8644 27.5735 53.3003 31.2752 30.4571 0.2220 4.1755 0.0308 1.5787 2.9685 7.7269 3.2142 0.9671 11.6572 0.0702 44.2157 67.5669 5.6004 10.9876 2.4776 6.9685 9.1747 0.7378 9.6708 37.2585 4.1804 10.8581 16.4734 29.4492 15.0538 5.8316 0.8311 5.3741 1.5191 3.4430 1.3714 7.7700 3.7181 12.1389 12.0399 19.0468 1.8298 24.2324 4.2781 4.9618 4.5278 2.3481 1.2230 5.6920 4.5373 28.0372 26.4289 1.2889 19.2205 20.8653 5.1583 2.5831 27.9677 24.2159 32.3962 8.1995 7.9702 23.7357 7.1743 3.5104 6.0064 54.6668 80.9656 89.9410 152.1548 79.9899 7.4811 38.2982 43.7712 49.8566 68.4101 27.7967 17.7806 15.5163 33.4351 2.4328 5.5876 4.3948 18.3713 10.4086 29.4256 10.5978
temp: 298.150 k
press: 1.00000 atm
elementType: 17 16 7 7 6 6 6 6 6 6 6 6 6 6 6 6 6 6 6 6 6 6 6 1 1 1 1 1 1 1 1 1 1 1 1 1 1 1 1 1 1 1 1 1
symmnumber: 1
zpe: 934579.3 jmol-1
zpe.correction: 0.355962 hartree
zpe.thermalcorrener: 0.376498 hartree
zpe.thermalcorrenthalpy: 0.377442 hartree
zpe.thermalcorrgfe: 0.305882 hartree
zpe.sumelectzpe: -1702.531347 hartree
zpe.sumelectthermal: -1702.510811 hartree
zpe.sumelectthermalent: -1702.509867 hartree
zpe.sumelectthermalfe: -1702.581427 hartree
dipole: -3.5872 -0.3274 0.8571
dipole: 3.7026
quadrupole: -154.2388 -135.6268 -149.1937
quadrupole: 2.8962 -5.3175 -1.4298
quadrupole: -7.8857 10.7263 -2.8406 2.8962 -5.3175 -1.4298
hfenergy: -1702.8873093 hartree
pointgroup: C01 [X(C19H21Cl1N2S1)]
dipole: -1.2088656 0.504197 -0.6375742 debye
polarizability: 241.6738095|-2.8897254|284.3389049|47.9554577|2.9201823|194.8718524 unknown
InChI: InChI=1S/C19H21ClN2S/c1-21-9-11-22(12-10-21)17-13-14-5-4-7-16(20)19(14)23-18-8-3-2-6-15(17)18/h2-8,17H,9-13H2,1H3
charge 0 multiplicity 1
44 atoms
Cl 3.873445 0.214794 2.706816
S  2.822542 -1.382174 0.018595
N  -1.280469 0.256857 -1.018894
N  -3.625192 1.377187 0.232726
C  -0.1782 -0.552803 -1.629249
C  -2.59156 0.229623 -1.703743
C  -1.450521 0.19714 0.452655
C  -3.44367 1.424365 -1.236107
C  -2.312881 1.380423 0.924361
C  1.075921 0.34213 -1.864325
C  0.067977 -1.901718 -0.919253
C  1.580238 1.065495 -0.635549
C  1.210696 -2.294484 -0.166751
C  -4.524663 2.4365 0.725356
C  2.363535 0.367895 0.325457
C  -0.993645 -2.84786 -1.017954
C  1.277869 2.431053 -0.415379
C  1.264336 -3.571585 0.453727
C  -0.941755 -4.11916 -0.416922
C  2.843862 1.05953 1.461108
C  0.201186 -4.486477 0.329169
C  1.759482 3.10585 0.727542
C  2.552987 2.421934 1.674437
H  -0.535704 -0.818849 -2.644777
H  -3.169658 -0.703559 -1.488981
H  -2.433446 0.29843 -2.796459
H  -0.463167 0.246768 0.941187
H  -1.942729 -0.751775 0.771892
H  -2.939938 2.372114 -1.560967
H  -4.438755 1.380574 -1.718814
H  -2.487938 1.294742 2.013464
H  -1.752181 2.332164 0.736472
H  0.786241 1.088111 -2.625113
H  1.885714 -0.2869 -2.286884
H  -4.679415 2.315987 1.812737
H  -5.508366 2.351871 0.228822
H  -4.133824 3.470883 0.545211
H  -1.879436 -2.568602 -1.600003
H  0.663096 2.959479 -1.150649
H  2.148529 -3.836877 1.043119
H  -1.78102 -4.814201 -0.527326
H  0.264497 -5.46632 0.814288
H  1.525306 4.163854 0.885619
H  2.938779 2.928595 2.563541
