program: Gaussian 09
title: 000203104
version: EM64L-G09RevD.01
frameworkgroup: C1[X(C14H19NO5)]
method: RPBEPBE
basis: SDD
operation: Freq
keyword: #p
keyword: freq=noraman
keyword: PBEPBE/SDD
title: #p freq=noraman PBEPBE/SDD
converged: YES YES NO NO
title: Mulliken charges:
elementType: O O O O O N C C C C C C C C C C C C C C H H H H H H H H H H H H H H H H H H H
charge: -0.307443 -0.260423 -0.480752 -0.287101 -0.340767 -0.368260 -0.051194 -0.102419 -0.344057 -0.355704 0.242547 0.251179 -0.373973 -0.378862 -0.228272 -0.225283 -0.372207 0.354338 -0.339323 -0.685501 0.246209 0.210290 0.211423 0.275177 0.259459 0.232512 0.386453 0.244346 0.249314 0.226993 0.227717 0.256742 0.214586 0.207707 0.222678 0.330775 0.210510 0.231226 0.209361
chargesum: 0.00000
title: Mulliken charges with hydrogens summed into heavy atoms:
elementType: O O O O O N C C C C C C C C C C C C C C
charge: -0.307443 -0.260423 -0.094299 -0.287101 -0.340767 -0.037484 0.195014 0.107871 0.142542 0.136266 0.242547 0.251179 -0.129627 -0.129548 -0.001279 0.002434 0.099121 0.354338 0.091061 -0.034404
polarizability: 2.52787822e+02 -1.06806317e+01 1.72461664e+02 6.06632265e+00 2.53661148e+00 1.04855763e+02
1716.lowfreq: -2.9373 0.0008 0.0009 0.0012 5.5528 6.8638 12.3860 24.9252 40.7187
frequency: 11.9356 24.6818 40.7009 45.2337 60.6144 77.3872 87.2075 104.7696 137.9267 148.3797 198.0285 214.6194 222.3720 240.9217 268.5609 286.9329 291.6238 322.7701 355.5265 401.9551 411.8907 448.3719 449.9378 461.8394 500.1706 510.4591 546.3604 557.0904 581.6173 591.7918 634.3489 670.9540 695.7871 711.5480 722.2199 734.1898 753.2201 759.2638 819.9116 825.6839 846.2899 866.5029 878.0428 881.3714 914.8525 930.5330 949.3753 964.6637 966.5696 1022.4384 1028.4409 1043.1074 1058.5225 1068.5636 1085.3411 1088.5969 1096.7042 1124.8451 1129.8205 1139.5804 1160.6752 1165.8254 1203.8824 1207.2173 1227.0352 1241.9157 1249.7998 1254.0141 1269.5787 1283.9403 1302.7486 1320.6676 1323.9950 1345.1362 1357.7641 1358.8487 1365.0220 1389.9302 1393.2563 1440.4412 1442.8737 1448.5479 1459.7287 1461.1136 1463.1528 1475.4296 1479.7772 1487.0193 1502.3016 1591.6031 1612.6617 1651.7692 2945.9426 2975.3415 2989.6033 2990.3598 2994.1262 3005.5100 3017.0252 3042.7626 3072.5386 3079.0099 3083.8666 3121.5756 3136.0501 3138.5670 3149.4986 3162.0318 3174.3978 3250.6438 3569.6651
redmass: 3.6572 4.3277 5.0208 4.7706 6.0395 5.8840 3.7237 2.6480 3.8582 3.2416 3.6735 4.2414 2.1664 1.9462 4.3246 4.6959 4.2836 4.1913 3.4464 2.8459 3.4312 2.9976 3.1558 4.1108 3.7386 4.7479 3.9821 3.9988 6.1118 1.2033 4.8042 3.3510 4.7238 4.3425 5.2774 1.2211 1.2370 1.4123 5.6840 2.7030 1.4013 2.1337 3.3195 2.6459 2.9426 1.3680 2.6027 1.2996 5.0099 2.2280 2.1740 2.5659 3.3132 2.7021 2.4221 3.9799 2.4148 1.9926 2.5933 2.3206 1.0884 2.3537 1.1811 1.9214 1.6513 1.5257 1.3878 1.2724 1.4461 1.2322 1.1976 1.2462 1.2056 1.4131 1.4074 1.2448 1.2805 5.8190 1.2411 1.6709 1.2375 1.6228 1.1507 1.1603 1.0759 2.6163 1.0562 1.0995 1.7394 7.5388 7.1095 7.1868 1.0828 1.0364 1.0749 1.0611 1.0663 1.0769 1.0644 1.0990 1.1004 1.0985 1.0997 1.1018 1.0851 1.0975 1.0898 1.0947 1.1006 1.0677 1.0771
irintensity: 0.1417 0.3237 1.1283 1.6643 0.4416 0.5474 1.9635 2.4347 1.3577 7.6427 12.3346 0.7004 1.4163 2.3780 11.0360 5.9868 1.4071 1.7089 39.5679 11.8174 6.4946 1.1338 7.1776 0.6875 1.3413 1.3671 1.6651 8.9983 0.1099 114.9893 3.7433 7.9981 9.5794 0.3356 20.2548 139.4335 109.6252 25.8971 32.3369 2.3702 0.1513 8.6666 30.3481 48.5375 8.2871 5.4190 108.3031 0.0167 3.5223 8.4889 11.6070 54.3072 101.5331 15.9217 3.8186 39.6524 11.7261 17.7791 75.9025 6.9771 6.4490 19.1167 5.4811 289.9133 67.7595 81.1506 149.0537 1.3725 12.5326 74.1492 39.7898 40.3834 33.1600 2.7483 26.1016 1.6309 2.6365 32.6804 24.6587 14.9577 20.3111 131.0893 33.7988 3.6320 8.5926 200.2614 19.1539 31.4626 288.9993 25.5232 4.6154 308.5558 27.7366 29.9244 21.2193 28.1180 36.3303 43.1572 41.0332 6.6453 76.7535 39.8547 19.5392 3.5452 1.1171 4.2715 13.7049 16.1322 16.5182 633.7178 40.3758
temp: 298.150 k
press: 1.00000 atm
elementType: 8 8 8 8 8 7 6 6 6 6 6 6 6 6 6 6 6 6 6 6 1 1 1 1 1 1 1 1 1 1 1 1 1 1 1 1 1 1 1
symmnumber: 1
zpe: 830502.4 jmol-1
zpe.correction: 0.316322 hartree
zpe.thermalcorrener: 0.335885 hartree
zpe.thermalcorrenthalpy: 0.336830 hartree
zpe.thermalcorrgfe: 0.265359 hartree
zpe.sumelectzpe: -974.231892 hartree
zpe.sumelectthermal: -974.212328 hartree
zpe.sumelectthermalent: -974.211384 hartree
zpe.sumelectthermalfe: -974.282854 hartree
dipole: 4.7796 3.1490 0.6995
dipole: 5.7663
quadrupole: -93.8436 -122.1730 -118.4594
quadrupole: 3.3866 3.8451 -1.7455
quadrupole: 17.6484 -10.6810 -6.9674 3.3866 3.8451 -1.7455
hfenergy: -974.5482136 hartree
pointgroup: C01 [X(C14H19N1O5)]
dipole: -1.8606638 1.0380079 -0.7791794 debye
polarizability: 252.8012397|12.2826549|159.9371517|3.8773721|-26.06652|117.3668572 unknown
InChI: InChI=1S/C14H19NO5/c1-2-7-15-14(17)19-8-10(16)13-9-18-11-5-3-4-6-12(11)20-13/h3-6,10,13,15-16H,2,7-9H2,1H3
charge 0 multiplicity 1
39 atoms
O  1.76664 0.47483 -0.342116
O  3.451823 -1.676944 0.692945
O  -0.71608 -1.895816 0.968446
O  -2.243583 0.681999 -0.43853
O  -3.281063 -1.161662 0.615275
N  -4.416916 0.217734 -0.901229
C  1.232678 -0.605151 0.529298
C  -0.250037 -0.778958 0.155428
C  2.037666 -1.89105 0.311183
C  -1.026263 0.529187 0.412095
C  3.180066 0.557187 -0.34948
C  3.998209 -0.485868 0.166921
C  3.770468 1.718779 -0.88654
C  5.400734 -0.341344 0.168897
C  5.175759 1.854337 -0.895382
C  5.990538 0.827989 -0.35752
C  -5.700984 -0.504084 -0.84998
C  -3.325463 -0.168352 -0.174379
C  -6.78092 0.221612 -0.013057
C  -7.175742 1.603267 -0.577401
H  1.330565 -0.287416 1.587455
H  -0.31314 -1.007096 -0.932591
H  1.987795 -2.197616 -0.752651
H  1.660687 -2.695936 0.956059
H  -0.416987 1.396975 0.118234
H  -1.317012 0.594556 1.478011
H  -1.723121 -1.853609 0.978648
H  3.11714 2.502763 -1.282904
H  6.006485 -1.156495 0.577144
H  5.63009 2.758469 -1.313637
H  7.080372 0.933245 -0.354355
H  -5.492117 -1.497472 -0.4182
H  -6.062991 -0.648511 -1.886674
H  -7.67311 -0.434258 0.02268
H  -6.41833 0.324121 1.0273
H  -4.32314 1.059168 -1.471484
H  -6.320266 2.30467 -0.569132
H  -7.979426 2.061727 0.025753
H  -7.543224 1.520722 -1.61823
