program: Gaussian 09
title: 000203140
version: EM64L-G09RevD.01
frameworkgroup: C1[X(C16H22N2O5)]
method: RPBEPBE
basis: SDD
operation: Freq
keyword: #p
keyword: freq=noraman
keyword: PBEPBE/SDD
title: #p freq=noraman PBEPBE/SDD
converged: YES YES NO NO
title: Mulliken charges:
elementType: O O O O O N N C C C C C C C C C C C C C C C C H H H H H H H H H H H H H H H H H H H H H H
charge: -0.245447 -0.244004 -0.413658 -0.272161 -0.343760 -0.092227 -0.463441 -0.328375 -0.347559 -0.334611 -0.324038 -0.318774 -0.572566 0.206712 0.554337 -0.611054 -0.369075 0.074471 0.198475 -0.326383 0.242958 -0.220307 -0.671387 0.202986 0.191425 0.193221 0.217465 0.259718 0.187680 0.214995 0.191823 0.194145 0.215679 0.219133 0.260847 0.312858 0.250339 0.310323 0.266299 0.387792 0.232786 0.233052 0.214688 0.232312 0.232307
chargesum: 0.00000
title: Mulliken charges with hydrogens summed into heavy atoms:
elementType: O O O O O N N C C C C C C C C C C C C C C C C
charge: -0.245447 -0.244004 -0.025866 -0.272161 -0.343760 -0.092227 -0.150583 0.066036 0.063128 0.112787 0.082780 0.091050 -0.092585 0.206712 0.554337 -0.360715 -0.058752 0.074471 0.198475 -0.060084 0.242958 0.245530 0.007921
polarizability: 3.54560402e+02 -2.65881096e+00 2.07295390e+02 -6.90001083e+00 1.36574632e+00 1.19567108e+02
1716.lowfreq: -16.0320 -3.3996 -0.0009 0.0004 0.0013 0.7337 9.0957 10.9412 26.4386
frequency: -6.5674 10.5480 26.3765 34.8306 52.9151 68.2970 72.9709 77.2940 97.5870 123.5499 132.6988 155.3619 155.7726 195.0260 234.4730 237.1532 245.9448 251.6931 269.5769 299.2097 308.1958 311.8543 320.2284 380.4521 395.3920 418.7760 451.0009 452.0927 456.5020 471.9533 511.5456 568.2645 573.5547 588.2190 616.2126 643.0947 674.1926 684.9161 701.2159 749.4046 763.6044 774.5319 792.6718 798.5713 806.9819 817.3115 833.4600 841.3591 853.9565 865.2384 876.0010 900.1132 915.0732 974.4587 994.4464 999.1124 1017.5638 1027.0389 1038.8732 1053.7151 1057.3661 1069.3691 1087.5308 1104.3284 1113.2986 1131.6285 1135.5239 1139.1312 1143.6354 1167.5290 1190.6006 1197.4672 1207.4024 1232.1975 1240.8278 1250.9770 1267.1197 1275.5537 1289.4142 1296.5474 1306.2951 1322.9868 1331.6477 1342.0477 1346.1100 1363.6045 1371.1162 1372.2404 1389.9824 1392.1541 1404.1703 1430.8010 1442.1985 1443.5628 1450.0458 1451.2481 1459.0157 1463.7969 1472.6657 1479.8054 1485.5680 1493.6996 1494.3228 1563.2007 1586.3403 1628.4304 1655.4072 2856.2963 2859.0901 2875.4545 2953.3434 2958.8849 2971.6682 2981.6108 2997.7586 3015.0665 3029.9248 3032.4905 3037.0920 3056.7245 3074.4950 3080.9123 3084.9000 3094.4879 3110.2536 3144.1759 3167.0305 3207.9596 3524.1909
redmass: 3.0052 6.1987 4.5474 2.8435 4.3840 6.3682 2.9165 4.3280 3.2371 5.2813 4.3363 4.2706 4.8196 3.1498 2.2716 2.1505 2.1429 2.5128 5.6526 6.1722 2.6716 4.9096 4.1107 3.9006 2.2708 3.9503 5.9025 3.7098 3.4068 3.0113 5.1843 6.4855 3.7954 2.2049 3.1406 4.3613 1.9481 2.2822 4.7534 3.4404 4.7664 1.9793 5.7945 1.1054 3.4848 2.3728 4.1672 1.6165 1.4900 1.3081 1.3563 2.4710 5.1468 3.7721 1.3118 2.7439 2.2948 2.2114 1.9466 2.1295 3.0640 5.6681 3.7471 2.0906 2.2322 2.2847 1.4614 2.5474 1.6357 2.4317 1.0840 1.4292 1.4701 1.8646 1.2388 1.1326 1.2943 2.1441 1.2547 1.3628 2.0822 1.6891 1.2952 1.6125 1.3077 1.4850 2.0060 1.2816 1.7839 2.3577 1.3788 4.4140 1.0909 1.0819 1.0887 1.0933 1.0954 1.0398 1.0659 1.0923 1.1732 2.2017 2.4489 4.9614 4.2823 4.4353 5.1986 1.0711 1.0702 1.0690 1.0667 1.0665 1.0691 1.0585 1.0359 1.0582 1.0887 1.0914 1.0935 1.0943 1.1066 1.0961 1.0978 1.0985 1.1030 1.0921 1.0907 1.0953 1.0764
irintensity: 0.1100 0.0142 0.6334 0.0168 0.1287 10.2471 2.0442 1.6575 0.0659 2.5989 0.6361 2.2489 1.0282 14.0108 2.9718 0.6341 0.9539 2.2326 3.8117 0.9524 11.9532 7.8425 2.6189 29.7598 13.2671 10.2726 2.0585 5.6256 3.0761 1.3281 9.6368 2.9755 1.7136 8.4460 8.3654 4.6003 62.6690 0.6129 11.4597 0.2084 6.3994 1.7255 3.1654 3.2612 15.0448 19.7897 10.2472 0.8077 0.4539 236.3373 0.5598 16.1181 11.2286 12.4211 1.1984 46.9307 33.5108 11.0671 15.8341 30.6468 24.5950 276.1297 72.7141 2.6485 2.8193 77.4825 5.6591 35.6194 144.6614 32.9035 6.0398 51.0741 87.3532 120.7546 43.7245 0.0120 15.2326 503.1995 19.4485 22.1437 17.9116 20.0829 9.6097 389.3024 87.3908 6.6254 314.2192 31.8119 67.6528 5.3992 28.5877 115.7419 7.2893 3.2461 3.5665 18.4862 4.5906 12.7030 6.3890 12.1919 68.8957 330.2043 74.7168 49.1654 223.4381 141.6974 360.7305 31.3721 57.0408 162.0780 36.5167 101.9003 358.3066 13.2380 17.7362 21.3073 48.0798 36.8985 4.8951 26.4202 5.6620 39.8832 37.4062 29.8555 42.5626 6.7643 1.6726 6.8179 12.9052
temp: 298.150 k
press: 1.00000 atm
elementType: 8 8 8 8 8 7 7 6 6 6 6 6 6 6 6 6 6 6 6 6 6 6 6 1 1 1 1 1 1 1 1 1 1 1 1 1 1 1 1 1 1 1 1 1 1
symmnumber: 1
zpe: 960697.9 jmol-1
zpe.correction: 0.365911 hartree
zpe.thermalcorrener: 0.387780 hartree
zpe.thermalcorrenthalpy: 0.388724 hartree
zpe.thermalcorrgfe: 0.312172 hartree
zpe.sumelectzpe: -1106.783996 hartree
zpe.sumelectthermal: -1106.762127 hartree
zpe.sumelectthermalent: -1106.761183 hartree
zpe.sumelectthermalfe: -1106.837734 hartree
dipole: -1.1574 -0.3111 -0.0504
dipole: 1.1996
quadrupole: -135.5342 -136.2719 -138.3931
quadrupole: 19.3531 -2.8802 -1.3975
quadrupole: 1.1989 0.4611 -1.6600 19.3531 -2.8802 -1.3975
hfenergy: -1107.1499066 hartree
pointgroup: C01 [X(C16H22N2O5)]
dipole: -0.4528662 0.1287644 0.0327886 debye
polarizability: 354.5593438|-1.1756492|205.9063302|7.6195219|10.8297273|120.9572259 unknown
InChI: InChI=1S/C16H22N2O5/c1-2-23-16(21)13-4-3-12(11-14(13)19)17-15(20)5-6-18-7-9-22-10-8-18/h3-4,11,17,19H,2,5-10H2,1H3
charge 0 multiplicity 1
45 atoms
O  8.134383 -0.216433 -0.237144
O  1.241228 1.539973 0.475448
O  -3.88619 -2.674895 -0.344694
O  -5.790877 1.099401 0.082428
O  -6.001695 -1.194487 -0.244359
N  5.295849 0.292124 0.165412
N  0.442312 -0.645447 0.143358
C  5.775154 -0.96168 -0.474131
C  6.253574 1.398384 -0.106431
C  3.912649 0.656809 -0.219501
C  7.18557 -1.307593 0.033123
C  7.653188 1.02005 0.403171
C  2.867149 -0.30095 0.389624
C  1.456526 0.301704 0.333787
C  -0.964697 -0.459638 0.10256
C  -1.756829 -1.615278 -0.095236
C  -1.578927 0.822616 0.251118
C  -3.794681 -0.232544 -0.002381
C  -3.162526 -1.517356 -0.149565
C  -2.974957 0.912154 0.19635
C  -5.256642 -0.165296 -0.065538
C  -7.284735 1.201524 0.021183
C  -7.627851 2.676722 0.192499
H  5.092183 -1.792904 -0.218102
H  5.798947 -0.864951 -1.589957
H  6.315421 1.629275 -1.199866
H  5.904504 2.308812 0.416178
H  3.696781 1.667029 0.171378
H  3.781871 0.699931 -1.330891
H  7.591474 -2.188376 -0.491508
H  7.145886 -1.507612 1.125903
H  7.622543 0.882892 1.505566
H  8.394317 1.794202 0.144788
H  2.888999 -1.294217 -0.098285
H  3.137375 -0.45048 1.454198
H  0.756449 -1.612298 0.02826
H  -1.308032 -2.608009 -0.21073
H  -0.954314 1.702871 0.40256
H  -3.463808 1.884349 0.307621
H  -4.878323 -2.421481 -0.358104
H  -7.705669 0.569213 0.823203
H  -7.61757 0.794718 -0.95032
H  -8.724431 2.8088 0.153929
H  -7.266801 3.056962 1.163219
H  -7.176779 3.283611 -0.610825
