program: Gaussian 09
title: 000203085
version: EM64L-G09RevD.01
frameworkgroup: C1[X(C10H11ClN2O3)]
method: RPBEPBE
basis: SDD
operation: Freq
keyword: #p
keyword: freq=noraman
keyword: PBEPBE/SDD
title: #p freq=noraman PBEPBE/SDD
converged: YES YES NO NO
title: Mulliken charges:
elementType: Cl O O O N N C C C C C C C C C C H H H H H H H H H H H
charge: -0.076320 -0.260770 -0.289758 -0.151937 -0.220967 -0.405402 0.477824 -0.357062 -0.362855 0.312151 -0.054254 -0.188597 -0.266246 -0.604404 0.275339 -0.746561 0.274703 0.309578 0.232287 0.257195 0.327321 0.228757 0.278385 0.228722 0.268717 0.255414 0.258741
chargesum: 0.00000
title: Mulliken charges with hydrogens summed into heavy atoms:
elementType: Cl O O O N N C C C C C C C C C C
charge: -0.076320 -0.260770 -0.289758 -0.151937 -0.220967 -0.078081 0.477824 -0.082359 -0.053278 0.312151 -0.054254 0.043690 -0.009051 0.131460 0.275339 0.036312
polarizability: 2.00304216e+02 1.31972430e+00 1.53880286e+02 4.22916855e+00 -1.76121401e+01 8.68054893e+01
1716.lowfreq: -8.3834 -0.0014 -0.0012 -0.0005 1.2800 6.7363 25.6545 41.4850 47.1110
frequency: 25.6228 41.4813 47.0867 58.8631 68.4843 73.3653 103.8719 118.9456 160.6924 174.6802 193.1867 200.1800 286.6611 302.4360 321.6282 358.7401 380.1261 385.6203 421.5698 437.4086 516.9265 553.6448 557.9961 585.0278 627.7877 671.7752 678.6318 683.8046 692.3694 722.1750 782.5297 794.2872 866.5418 901.7558 934.8181 962.7239 976.9130 981.7029 990.5642 1034.7971 1074.3768 1096.8889 1116.7120 1126.1921 1131.2649 1143.5108 1179.6856 1213.8463 1286.1209 1303.2567 1375.4448 1384.2210 1426.2179 1432.5784 1450.9792 1452.8100 1459.7097 1462.6468 1487.4634 1514.6629 1568.2243 1605.6467 1634.4403 1730.0634 2980.5373 3007.0091 3059.0341 3100.4462 3114.7766 3137.9415 3147.2655 3180.0264 3191.2795 3208.7968 3575.2534
redmass: 6.2686 4.8637 4.4550 1.9996 1.5777 3.0189 1.3407 4.6306 3.4976 6.2094 6.9642 5.1155 5.5480 3.5508 7.4510 6.6456 5.7237 7.9247 6.7506 3.2609 4.7170 4.5729 3.4832 1.1969 6.9310 3.9359 5.5742 6.6468 5.4058 6.9158 1.3309 5.2475 1.4677 1.3661 5.8376 4.2425 4.9718 1.3709 2.9329 1.6125 2.0520 1.5611 4.2209 1.2968 2.5893 1.5840 1.0885 2.3482 1.3777 3.7289 8.4833 1.2112 1.3077 2.3470 1.0701 1.0534 1.3825 2.2787 1.0463 1.4373 7.0587 6.9272 8.5306 11.5814 1.0355 1.0379 1.1027 1.0944 1.0979 1.1025 1.0890 1.0957 1.0919 1.0950 1.0769
irintensity: 1.3264 2.2747 2.8105 4.2835 1.2871 2.5281 1.0102 1.4098 1.0374 0.2152 0.8083 0.5450 6.2654 4.4566 4.0436 3.0608 36.3682 7.8219 0.8222 5.4365 27.2433 3.1388 11.0786 104.3080 6.3650 2.6389 42.9638 19.1468 12.3268 107.4745 67.6858 20.9569 30.5824 2.2736 24.2370 58.8274 12.4494 2.5565 2.0833 5.8704 20.7046 26.9820 9.8375 1.0617 158.8714 55.6661 1.3987 230.7967 32.8313 197.7180 8.3912 51.6610 50.0745 7.4239 10.4958 7.9278 382.3362 57.9642 18.0166 278.0402 53.0361 97.5063 199.7246 147.5990 91.3544 0.1262 35.7514 4.2049 2.1586 4.2153 10.5892 3.3355 0.1384 8.5395 27.8159
temp: 298.150 k
press: 1.00000 atm
elementType: 17 8 8 8 7 7 6 6 6 6 6 6 6 6 6 6 1 1 1 1 1 1 1 1 1 1 1
symmnumber: 1
zpe: 520595.4 jmol-1
zpe.correction: 0.198284 hartree
zpe.thermalcorrener: 0.214973 hartree
zpe.thermalcorrenthalpy: 0.215917 hartree
zpe.thermalcorrgfe: 0.151491 hartree
zpe.sumelectzpe: -1181.690983 hartree
zpe.sumelectthermal: -1181.674295 hartree
zpe.sumelectthermalent: -1181.673351 hartree
zpe.sumelectthermalfe: -1181.737776 hartree
dipole: -3.1089 3.6968 -1.5698
dipole: 5.0790
quadrupole: -91.1634 -89.3695 -106.5102
quadrupole: -12.7916 8.2018 -4.0315
quadrupole: 4.5176 6.3116 -10.8291 -12.7916 8.2018 -4.0315
hfenergy: -1181.8892675 hartree
pointgroup: C01 [X(C10H11Cl1N2O3)]
dipole: 1.5141204 -1.0836317 -0.7253717 debye
polarizability: 197.1484117|12.3298316|153.7521698|-8.3268944|21.5602959|90.0894093 unknown
InChI: InChI=1S/C10H11ClN2O3/c1-7(14)16-13(10(15)12-2)9-5-3-4-8(11)6-9/h3-6,12H,1-2H3
charge 0 multiplicity 1
27 atoms
Cl -3.95981 -1.89655 -0.75838
O  1.202085 -1.042326 -0.635019
O  1.500997 2.452559 0.274813
O  1.387988 -1.607493 1.666227
N  0.75489 0.279379 -0.203336
N  3.005946 0.875001 -0.582965
C  -0.647279 0.398711 0.030962
C  -1.501615 -0.645268 -0.418473
C  -1.198834 1.530464 0.694326
C  1.762009 1.286013 -0.141612
C  -2.880536 -0.53793 -0.178314
C  -2.591781 1.595689 0.899588
C  -3.460314 0.563174 0.474915
C  4.155048 1.784816 -0.551957
C  1.458756 -1.95898 0.487604
C  1.772256 -3.316255 -0.0906
H  -1.099884 -1.503927 -0.958922
H  -0.539488 2.332703 1.025107
H  -3.010329 2.468375 1.412084
H  -4.538409 0.614743 0.646489
H  3.100443 -0.05194 -0.996894
H  4.98171 1.360486 0.046746
H  3.827834 2.728821 -0.08875
H  4.522736 2.002718 -1.571929
H  0.862718 -3.942906 -0.041875
H  2.088414 -3.248258 -1.142373
H  2.550352 -3.80532 0.516541
